program: Gaussian 09
title: 000164176
version: EM64L-G09RevD.01
frameworkgroup: C1[X(C15H9Cl2NO)]
method: RPBEPBE
basis: SDD
operation: Freq
keyword: #p
keyword: freq=noraman
keyword: PBEPBE/SDD
title: #p freq=noraman PBEPBE/SDD
converged: YES YES NO NO
title: Mulliken charges:
elementType: Cl Cl O N C C C C C C C C C C C C C C C H H H H H H H H H
charge: -0.016862 -0.008646 -0.307502 0.002542 0.240482 0.303678 0.065818 -0.374666 -0.216053 -0.293939 0.446317 -0.228992 -0.240025 -0.364753 -0.297105 -0.334174 -0.213363 -0.208015 -0.224304 0.270595 0.254420 0.235601 0.257337 0.243608 0.266708 0.260646 0.240431 0.240216
chargesum: 0.00000
title: Mulliken charges with hydrogens summed into heavy atoms:
elementType: Cl Cl O N C C C C C C C C C C C C C C C
charge: -0.016862 -0.008646 -0.307502 0.002542 0.240482 0.303678 0.065818 -0.104070 -0.216053 -0.039519 0.446317 0.006609 0.017312 -0.121145 -0.297105 -0.067467 0.047282 0.032417 0.015912
polarizability: 2.80596436e+02 -2.18994607e+01 1.67723055e+02 -1.56348508e+01 -5.77477116e+00 1.31680675e+02
1716.lowfreq: -6.1474 -2.5039 -0.0006 0.0020 0.0022 4.9761 17.3555 23.9355 57.3792
frequency: 17.3175 23.9324 57.3778 68.8220 135.4802 160.4066 177.4944 179.8574 198.2951 228.8858 261.8639 270.8226 364.5994 374.2157 437.0284 461.8747 464.1914 469.4494 487.3487 498.1715 518.0835 541.5975 584.3208 602.8999 639.2418 652.3041 661.4983 719.0313 755.6295 768.0365 773.8498 796.7426 812.0974 818.3565 839.1409 862.3367 870.5506 912.7337 945.8145 948.1316 983.8856 984.9734 1019.9321 1030.5297 1044.7809 1059.8585 1090.4038 1120.8689 1163.5690 1169.8627 1196.9935 1207.4247 1226.1644 1239.0671 1253.4176 1331.8186 1364.4433 1370.3551 1378.8345 1415.4724 1425.6983 1442.5919 1455.3356 1489.3310 1543.4337 1582.2863 1583.0785 1591.8426 1616.6181 3129.0062 3145.1335 3147.3298 3157.7858 3168.6606 3169.6051 3173.3235 3180.3830 3180.8850
redmass: 10.3365 6.7057 6.0305 10.4360 5.4188 7.5929 4.6497 6.0235 10.2287 7.1984 5.6615 6.2369 9.4822 8.7436 3.9597 5.5254 5.4617 3.8965 4.8320 5.5879 7.0999 5.6363 8.3974 3.8912 5.2934 5.0707 6.5007 3.5772 2.8607 1.7201 1.8878 5.5829 6.1694 2.2076 1.5376 1.4234 6.9307 1.3927 1.3772 1.4219 1.3335 1.3232 5.5495 2.5510 2.6571 2.2737 2.8009 1.5798 1.2859 1.0746 2.5134 2.0556 1.9613 2.7432 1.5391 5.2446 2.9169 10.8343 1.8660 3.7852 2.2223 2.6810 2.6074 4.3804 7.5316 6.8315 6.9132 7.0065 7.6714 1.0903 1.0860 1.0872 1.0906 1.0926 1.0953 1.0946 1.1009 1.0986
irintensity: 0.1474 0.5310 0.5890 0.3746 0.1974 0.3187 6.9948 0.3517 0.4966 1.6055 1.2349 1.3167 0.8889 2.5805 8.7183 2.0674 5.0895 3.6561 0.4020 4.7245 0.6909 0.5267 8.2410 0.3254 2.6987 1.6490 12.4608 13.7206 23.8637 37.1141 98.8442 15.5640 17.2923 40.4626 29.5472 0.4982 96.3357 0.0374 2.4153 0.5955 0.9820 0.0895 36.8344 19.8613 15.3366 6.2399 3.3657 3.0412 14.0477 2.2350 27.5154 95.1756 1.3974 226.4441 43.2845 10.5155 1.9991 0.0698 160.3418 50.4636 14.8307 15.0587 153.9700 177.6601 17.5016 48.1400 3.9488 6.2682 5.2438 19.5177 1.2134 6.4820 9.7338 2.4870 5.4681 7.1608 11.0083 9.4485
temp: 298.150 k
press: 1.00000 atm
elementType: 17 17 8 7 6 6 6 6 6 6 6 6 6 6 6 6 6 6 6 1 1 1 1 1 1 1 1 1
symmnumber: 1
zpe: 515559.5 jmol-1
zpe.correction: 0.196366 hartree
zpe.thermalcorrener: 0.211790 hartree
zpe.thermalcorrenthalpy: 0.212734 hartree
zpe.thermalcorrgfe: 0.151076 hartree
zpe.sumelectzpe: -1625.781663 hartree
zpe.sumelectthermal: -1625.766239 hartree
zpe.sumelectthermalent: -1625.765295 hartree
zpe.sumelectthermalfe: -1625.826954 hartree
dipole: 5.5750 1.0477 -1.9559
dipole: 6.0004
quadrupole: -112.0181 -118.7512 -120.7817
quadrupole: -17.2483 -2.1528 -0.6032
quadrupole: 5.1656 -1.5675 -3.5981 -17.2483 -2.1528 -0.6032
hfenergy: -1625.9780293 hartree
pointgroup: C01 [X(C15H9Cl2N1O1)]
dipole: 2.0884452 -0.9081102 0.6219044 debye
polarizability: 275.2777033|0.8056328|161.5935516|38.9311887|12.4739952|143.1289113 unknown
InChI: InChI=1S/C15H9Cl2NO/c16-11-5-1-2-7-14(11)19-13-8-9-18-15-10(13)4-3-6-12(15)17/h1-9H
charge 0 multiplicity 1
28 atoms
Cl -5.278904 1.250404 -0.372401
Cl 2.333718 0.509615 -2.152685
O  0.818141 -0.977131 0.065808
N  -2.403829 1.77884 0.458564
C  -1.502529 -0.439725 -0.246965
C  -0.204389 -0.019463 0.207344
C  -2.583012 0.518588 -0.090122
C  -1.738512 -1.723367 -0.827188
C  -3.883622 0.106589 -0.539187
C  -0.021584 1.249283 0.758467
C  2.152495 -0.630477 0.397526
C  -3.024796 -2.068507 -1.247183
C  -4.108479 -1.149526 -1.102606
C  -1.160973 2.106525 0.856952
C  2.994987 0.009517 -0.540495
C  2.669736 -1.035927 1.645848
C  4.34874 0.254059 -0.236302
C  4.025823 -0.794722 1.957142
C  4.86288 -0.149073 1.017624
H  -0.900662 -2.416855 -0.936728
H  0.955773 1.592107 1.107278
H  -3.216082 -3.049006 -1.694916
H  -5.114252 -1.424642 -1.433313
H  -1.04123 3.108827 1.284984
H  2.000606 -1.540826 2.349276
H  4.988543 0.746977 -0.974035
H  4.42518 -1.111994 2.925518
H  5.915534 0.038508 1.251995
