program: Gaussian 09
title: 000164159
version: EM64L-G09RevD.01
frameworkgroup: C1[X(C17H13F4N3)]
method: RPBEPBE
basis: SDD
operation: Freq
keyword: #p
keyword: freq=noraman
keyword: PBEPBE/SDD
title: #p freq=noraman PBEPBE/SDD
converged: YES YES NO NO
title: Mulliken charges:
elementType: F F F F N N N C C C C C C C C C C C C C C C C C H H H H H H H H H H H H H
charge: -0.159896 -0.179516 -0.160487 -0.173766 -0.386625 -0.090169 -0.014487 -0.554611 -0.396167 0.503005 0.167969 -0.516974 0.263719 -0.405363 0.296522 -0.075299 -0.199912 -0.381671 -0.347765 0.252702 0.254079 -0.234424 -0.369740 -0.394906 0.237839 0.221855 0.226887 0.283137 0.327457 0.289347 0.245323 0.240342 0.269710 0.211978 0.242009 0.261177 0.246722
chargesum: 0.00000
title: Mulliken charges with hydrogens summed into heavy atoms:
elementType: F F F F N N N C C C C C C C C C C C C C C C C C
charge: -0.159896 -0.179516 -0.160487 -0.173766 -0.059168 -0.090169 -0.014487 -0.094918 0.113857 0.503005 0.167969 -0.227627 0.263719 -0.160039 0.296522 -0.075299 0.040430 -0.111961 -0.135787 0.252702 0.254079 0.007585 -0.108563 -0.148184
polarizability: 2.62633782e+02 -1.47839723e+01 2.44953658e+02 3.80793028e+01 1.40313548e+01 1.16134054e+02
1716.lowfreq: -7.8782 -5.1359 -0.0005 -0.0003 0.0008 3.6603 5.8792 17.1669 20.7548
frequency: 2.0533 16.9235 20.6852 24.5663 47.6297 72.8205 84.4198 128.2175 156.1794 171.3656 188.1269 198.2650 234.8496 271.5750 292.3650 299.1813 303.9018 327.1349 344.3536 384.1827 413.4179 433.9198 459.4678 464.3319 480.8392 498.8454 512.2378 521.2305 525.1780 537.4725 544.5577 572.4339 603.2944 608.6534 635.8475 681.6982 695.3026 699.9079 708.1023 754.6359 793.3762 808.3902 815.9331 822.1342 837.7544 850.5274 885.4438 911.0349 930.6036 933.2262 943.0782 960.6741 962.9496 970.4015 988.6938 995.1689 1013.3643 1021.8139 1065.5884 1066.8763 1072.0790 1106.6157 1126.9322 1173.3308 1185.0471 1187.0813 1189.3702 1198.0267 1235.2870 1239.5852 1285.0114 1292.6346 1306.2628 1314.2425 1317.6266 1350.7700 1363.6198 1388.5771 1393.1075 1407.3040 1434.4765 1438.1759 1457.5212 1459.6057 1468.6789 1481.7736 1520.1704 1552.0966 1564.5805 1599.7386 1615.8277 1619.6255 2998.6651 3003.4302 3066.8037 3091.9226 3129.2666 3130.2444 3141.6765 3154.1881 3155.2401 3160.2117 3177.3012 3180.2388 3573.0032
redmass: 8.5847 8.3708 7.0994 7.9647 7.0807 5.9282 5.3045 7.2018 5.1917 8.0889 5.0174 3.9794 4.2815 7.0405 5.1876 5.3124 6.9443 7.3119 3.2027 5.0091 2.3518 5.5584 6.3736 3.4197 4.2527 4.7853 2.9424 3.3250 3.5978 5.6240 4.0931 6.3745 3.3347 11.1182 4.4969 5.0162 6.0056 7.1403 2.1335 1.4721 6.0596 1.7334 2.8712 5.0457 3.8859 5.3528 1.4260 1.7415 2.5628 1.4655 1.4489 2.8139 1.4578 4.7433 6.0553 1.3794 5.8427 1.9456 2.9433 2.9902 3.2889 1.8173 3.0419 1.3398 2.3421 1.1348 1.4281 1.7806 2.2034 1.5069 3.0266 3.4822 2.1474 1.6008 1.3589 1.5078 2.1968 7.8298 2.1548 2.5107 2.8712 2.6151 1.1670 2.5546 1.1364 2.4508 5.6339 2.6971 7.5000 6.1541 6.1421 6.9762 1.0657 1.0603 1.1019 1.0993 1.0890 1.0880 1.0925 1.0919 1.0922 1.0917 1.0976 1.0978 1.0764
irintensity: 0.7748 2.8800 1.2784 0.7865 0.2273 0.3926 1.2378 0.2136 1.2340 0.5374 0.8290 1.1688 0.3423 0.5353 0.1689 1.6865 2.7386 2.9921 4.5205 5.4892 16.9845 0.2785 4.6094 8.0521 0.1037 30.1063 29.1413 42.8894 11.1544 2.2653 5.8233 15.0503 9.1201 10.7573 6.9929 2.4520 2.8466 1.1068 33.8191 100.5102 3.5105 50.9273 37.4809 7.7440 31.2093 16.3579 3.8825 31.2163 15.2634 31.6651 9.1294 51.1876 4.4535 151.9678 7.5490 2.6320 146.1345 26.3290 44.7169 55.7379 79.9815 8.1197 9.1281 7.2947 20.4183 2.8322 3.5233 53.3271 10.1133 28.0462 62.8140 141.9282 4.9062 83.8016 28.3442 87.3718 4.4873 6.7343 70.5274 27.5909 22.1530 27.8352 50.3802 9.1515 13.4070 19.6397 303.9065 431.0055 48.8281 4.6305 4.4511 12.6404 42.1853 24.7084 24.4322 3.4095 6.5372 6.9012 5.8695 28.5816 9.9264 9.2388 5.9818 4.8159 38.4483
temp: 298.150 k
press: 1.00000 atm
elementType: 9 9 9 9 7 7 7 6 6 6 6 6 6 6 6 6 6 6 6 6 6 6 6 6 1 1 1 1 1 1 1 1 1 1 1 1 1
symmnumber: 1
zpe: 704625.5 jmol-1
zpe.correction: 0.268378 hartree
zpe.thermalcorrener: 0.288718 hartree
zpe.thermalcorrenthalpy: 0.289662 hartree
zpe.thermalcorrgfe: 0.213503 hartree
zpe.sumelectzpe: -1217.557973 hartree
zpe.sumelectthermal: -1217.537634 hartree
zpe.sumelectthermalent: -1217.536689 hartree
zpe.sumelectthermalfe: -1217.612848 hartree
dipole: -6.4168 2.5109 -2.7237
dipole: 7.4094
quadrupole: -156.9227 -129.6443 -138.3031
quadrupole: -16.8349 2.6984 2.7545
quadrupole: -15.2993 11.9791 3.3202 -16.8349 2.6984 2.7545
hfenergy: -1217.8263511 hartree
pointgroup: C01 [X(C17H13F4N3)]
dipole: -2.355181 -1.0260169 1.3776913 debye
polarizability: 252.5902614|12.6143933|247.5744219|-52.520067|0.5881641|123.5568107 unknown
InChI: InChI=1S/C17H13F4N3/c18-14-6-2-5-13-15(14)23-10-24-16(13)22-8-7-11-3-1-4-12(9-11)17(19,20)21/h1-6,9-10,22H,7-8H2
charge 0 multiplicity 1
37 atoms
F  -4.281044 2.619829 -0.166195
F  -2.037409 2.413236 0.114267
F  -2.968319 1.975807 -1.902358
F  5.415462 1.772293 -1.166436
N  0.498884 -1.512871 0.492358
N  2.440138 -2.269425 -0.587149
N  4.308931 -0.793284 -1.13598
C  -1.347768 -2.893282 -0.52744
C  -0.134472 -2.837208 0.454784
C  -2.442512 -1.914279 -0.138962
C  1.726883 -1.234551 -0.067619
C  -2.377233 -0.561941 -0.554285
C  2.241509 0.134051 -0.09097
C  -3.513592 -2.307598 0.707616
C  -3.340964 0.37364 -0.106871
C  3.573261 0.277578 -0.634683
C  -4.486391 -1.37712 1.133138
C  -4.401174 -0.024319 0.736938
C  1.520962 1.281154 0.359341
C  -3.179902 1.809947 -0.510734
C  4.125625 1.597585 -0.658449
C  2.107843 2.551381 0.300313
C  3.428767 2.715856 -0.206577
C  3.688045 -1.985421 -1.09354
H  -0.975177 -2.683669 -1.546445
H  -1.736444 -3.928847 -0.521895
H  -0.469141 -3.111194 1.473546
H  0.639198 -3.551643 0.130927
H  -0.027176 -0.74751 0.913085
H  -1.581325 -0.241177 -1.23602
H  -3.58577 -3.353413 1.029686
H  -5.31039 -1.702025 1.776516
H  -5.1445 0.705703 1.069804
H  0.496031 1.200395 0.739545
H  1.548674 3.429399 0.637273
H  3.90061 3.701445 -0.256655
H  4.233981 -2.841323 -1.503173
