program: Gaussian 09
title: 000013383
version: EM64L-G09RevD.01
frameworkgroup: C1[X(C4H3BrS)]
method: RPBEPBE
basis: SDD
operation: Freq
keyword: #p
keyword: freq=noraman
keyword: PBEPBE/SDD
title: #p freq=noraman PBEPBE/SDD
converged: NO NO NO NO
title: Mulliken charges:
elementType: Br S C C C C H H H
charge: 0.023603 0.299233 -0.016067 -0.060730 -0.536183 -0.528904 0.262101 0.283448 0.273499
chargesum: 0.00000
title: Mulliken charges with hydrogens summed into heavy atoms:
elementType: Br S C C C C
charge: 0.023603 0.299233 -0.016067 0.201372 -0.252735 -0.255405
polarizability: 1.06356943e+02 -6.91551855e-01 6.58204417e+01 8.43482239e-04 6.26890784e-04 2.53837417e+01
1716.lowfreq: -4.9623 -2.6570 -0.0012 -0.0011 0.0014 24.7928 176.6260 225.3271 301.2101
frequency: 176.6204 225.3268 301.2100 433.2558 592.6620 606.0407 670.8595 730.4149 765.6099 802.8429 858.1810 882.2149 1074.9689 1090.9260 1189.4654 1334.9749 1436.6090 1501.4939 3191.1346 3239.9331 3245.6150
redmass: 8.0498 6.5543 16.0207 4.3466 3.4384 9.3047 1.2229 7.3217 1.2763 5.2402 5.2747 1.3117 1.7193 1.1078 1.3168 2.3253 8.6874 6.1003 1.0930 1.0984 1.0988
irintensity: 1.4041 0.0592 1.8704 0.0071 24.2988 4.7633 5.8259 4.8014 129.3539 15.9089 48.9770 1.3367 5.0974 10.4173 7.1911 22.9780 2.7308 26.1969 0.9697 0.3007 2.4751
temp: 298.150 k
press: 1.00000 atm
elementType: 35 16 6 6 6 6 1 1 1
symmnumber: 1
zpe: 145647.5 jmol-1
zpe.correction: 0.055474 hartree
zpe.thermalcorrener: 0.061050 hartree
zpe.thermalcorrenthalpy: 0.061994 hartree
zpe.thermalcorrgfe: 0.024541 hartree
zpe.sumelectzpe: -565.285276 hartree
zpe.sumelectthermal: -565.279701 hartree
zpe.sumelectthermalent: -565.278756 hartree
zpe.sumelectthermalfe: -565.316209 hartree
dipole: 1.2239 0.5341 0.0000
dipole: 1.3353
quadrupole: -49.5202 -45.2859 -55.2509
quadrupole: 2.2247 0.0002 0.0002
quadrupole: 0.4988 4.7331 -5.2319 2.2247 0.0002 0.0002
hfenergy: -565.3407506 hartree
pointgroup: C01[X(C4H3Br1S1)]
dipole: -0.4925785 -0.1826939 -0.0000171 debye
dipolederiv: -0.5914474 0.0290995 0.0000259 0.0073675 -0.0505786 -0.0000052 -0.0000021 -0.0000279 -0.0013967 -0.321438 0.1281194 -0.0000004 0.1221801 -0.0877461 -0.0000187 -0.000003 0.0000055 0.1716213 1.016636 0.0056756 -0.000072 0.1233703 -0.0000639 -0.0000011 -0.0000523 0.0000362 -0.109889 -0.3958708 0.0719897 0.000007 0.1212333 -0.0154071 0.0000227 -0.0000136 0.0000128 -0.096923 0.1272744 -0.047034 0.0000172 -0.0702527 -0.1651694 -0.000021 -0.0000181 -0.0000371 -0.2940682 -0.0216515 -0.1970239 -0.0000013 -0.2757819 0.2235551 0.0000094 0.0000019 -0.000001 -0.335771 0.0865427 0.0823736 0.0000103 0.0345482 0.0080358 -0.0000179 0.0000522 -0.000016 0.2041086 0.0632192 -0.0438528 0.0000054 -0.0189799 0.0552192 0.000022 0.0000204 0.0000223 0.2322446 0.0367354 -0.029347 0.0000078 -0.0436848 0.0321551 0.0000098 0.0000146 0.0000052 0.2300735 unknown
polarizability: 106.1507185|-2.9656951|66.0266665|-0.0008774|-0.0005784|25.3837417 unknown
InChI: InChI=1S/C4H3BrS/c5-4-1-2-6-3-4/h1-3H
charge 0 multiplicity 1
9 atoms
Br 2.64351 0.053333 -0.000143
S  -1.807277 0.823317 0.000026
C  0.696134 0.048285 -0.000004
C  -0.07352 -1.174428 0.000041
C  -0.060189 1.208756 -0.000001
C  -1.438075 -0.93123 0.00005
H  0.368607 -2.172846 0.000027
H  0.278148 2.242465 -0.000055
H  -2.250038 -1.655751 0.000059
