program: Gaussian 09
title: 000164048
version: EM64L-G09RevD.01
frameworkgroup: C1[X(C16H27NO)]
method: RPBEPBE
basis: SDD
operation: Freq
keyword: #p
keyword: freq=noraman
keyword: PBEPBE/SDD
title: #p freq=noraman PBEPBE/SDD
converged: YES YES NO NO
title: Mulliken charges:
elementType: O N C C C C C C C C C C C C C C C C H H H H H H H H H H H H H H H H H H H H H H H H H H H
charge: -0.288633 -0.114664 -0.374546 -0.398746 -0.355981 -0.389924 -0.480073 0.184329 -0.472417 -0.325421 0.473686 -0.558353 -0.467981 -0.845793 -0.264596 0.368565 -0.781963 -0.793575 0.194452 0.211119 0.190883 0.209229 0.202959 0.240704 0.208864 0.213661 0.198111 0.242790 0.272277 0.209614 0.235128 0.215928 0.206651 0.211837 0.206351 0.225183 0.239572 0.227382 0.205870 0.218217 0.226055 0.209242 0.215435 0.225003 0.223568
chargesum: 0.00000
title: Mulliken charges with hydrogens summed into heavy atoms:
elementType: O N C C C C C C C C C C C C C C C C
charge: -0.288633 -0.114664 0.031025 0.001366 0.087682 0.032601 -0.039172 0.184329 0.009473 -0.090292 0.473686 -0.135774 -0.049794 -0.153656 -0.058725 0.368565 -0.128448 -0.129569
polarizability: 2.12525421e+02 -2.90212790e+00 1.87740236e+02 1.52154358e+01 8.74932735e+00 1.47154452e+02
1716.lowfreq: -11.4028 -7.7990 -0.0006 -0.0005 -0.0004 7.2747 14.0246 22.2077 26.0951
frequency: 12.2397 20.5873 25.5137 31.8569 41.9978 58.2089 90.0089 108.8955 116.1066 126.0473 152.9575 178.5041 189.7226 206.3486 229.5809 255.5064 273.3433 296.5254 316.1253 344.2298 359.4835 372.4732 400.8497 409.2281 411.6739 454.2418 477.8246 487.5565 504.6113 533.4366 551.4620 562.5108 669.0095 700.9623 749.2228 786.0672 802.9942 823.9758 829.3562 839.2272 856.1812 880.4720 902.1878 915.4303 933.8044 946.8965 961.1363 971.1228 989.8407 991.5778 999.4778 1012.5887 1034.4247 1043.4356 1051.2320 1077.2938 1079.8914 1094.6128 1113.1210 1118.8718 1132.9247 1159.9382 1177.5461 1182.4742 1195.4451 1215.6609 1225.3913 1232.5952 1252.0634 1266.9580 1282.4698 1304.8974 1310.8198 1326.5325 1328.7178 1339.4216 1343.0607 1349.3279 1360.0988 1363.0683 1369.6632 1386.6015 1391.4428 1397.6123 1412.9118 1450.2214 1452.9769 1454.6598 1457.4933 1459.6213 1462.7911 1465.7865 1465.9755 1469.7541 1470.1462 1472.9786 1477.6906 1480.1048 1488.1458 1581.8300 1683.8430 1694.9030 2952.7400 2953.5664 2958.1453 2961.6489 2966.7037 2969.3470 2970.8429 2972.6488 2979.8718 2983.6384 2988.2925 3019.8819 3022.6944 3022.7588 3028.8032 3032.6982 3036.4798 3042.3167 3045.3960 3047.5239 3057.0820 3067.2761 3077.3710 3081.4167 3088.0318 3089.5519 3094.1855
redmass: 3.4645 3.6794 3.4017 3.2876 2.8484 3.2295 3.4730 1.1726 1.2054 2.5589 1.4362 2.3467 2.2826 2.1719 3.7122 2.8257 2.5583 2.1461 2.3305 2.5550 2.5298 2.6977 2.2790 2.4780 2.5355 2.3637 1.7883 2.4304 2.8118 2.6493 2.7655 2.5951 3.9526 3.0775 2.2046 2.5675 2.5163 1.5551 1.6950 1.5594 1.7121 2.3023 1.7692 1.9323 1.8585 1.3818 2.0694 2.1062 1.8825 1.4236 1.8068 2.2344 1.6691 1.6822 1.9935 1.8780 1.6674 2.0431 1.9000 2.1256 1.6948 1.6066 1.6826 1.5506 1.2468 1.7222 1.5196 2.0328 1.3477 1.3296 1.2466 1.3729 1.3267 1.3007 1.5142 1.3708 1.4043 1.4641 1.4405 1.4484 1.4190 1.2991 1.3026 1.2301 2.0983 1.0867 1.0569 1.0739 1.0922 1.1060 1.0786 1.0698 1.0821 1.0518 1.0907 1.0755 1.0693 1.0780 1.1417 7.1561 6.7494 6.5159 1.0397 1.0605 1.0620 1.0389 1.0457 1.0591 1.0676 1.0620 1.0632 1.0649 1.0594 1.0960 1.0966 1.0965 1.0964 1.1016 1.0965 1.1020 1.0933 1.1000 1.0956 1.0918 1.0962 1.0956 1.0903 1.0956 1.0952
irintensity: 0.0765 1.4249 0.4772 1.1858 0.1876 1.2975 1.2122 0.8079 0.6366 0.8768 1.1444 0.4658 0.5420 2.3844 5.0267 4.7976 0.5241 0.5695 1.9448 0.9569 3.1759 1.6780 2.9710 5.1635 0.2628 6.7929 2.3048 9.6765 8.3247 3.6173 8.3007 0.3927 2.2108 2.8772 6.8769 0.8896 4.5583 6.2468 9.5199 4.7942 16.3425 1.5246 11.4671 3.8287 14.8429 0.3236 28.0089 8.9646 1.5406 10.0515 1.6519 0.7684 6.7884 5.5238 4.3732 12.6528 5.5848 9.3564 6.5640 11.5224 16.0181 12.7963 5.4390 69.5923 2.4862 3.1313 14.9275 4.0771 22.7915 17.6322 2.8558 0.1189 1.6288 13.9654 0.9499 3.2372 13.9887 9.0813 4.4928 0.2192 7.2895 14.9136 34.9981 15.3695 50.1079 12.9138 8.3950 2.4126 11.0949 18.8500 13.2048 5.5155 8.8637 42.2248 4.8169 18.7382 34.2983 9.9314 18.2241 309.1814 3.4692 3.1914 39.8169 8.7435 28.7869 53.9771 23.7764 88.5755 30.2670 30.2603 30.1309 29.4224 36.6247 60.3585 20.8236 6.9040 51.6202 21.3668 25.5950 80.4765 26.3463 11.3793 17.8461 15.1719 49.3480 18.2447 15.8955 36.1261 43.4990
temp: 298.150 k
press: 1.00000 atm
elementType: 8 7 6 6 6 6 6 6 6 6 6 6 6 6 6 6 6 6 1 1 1 1 1 1 1 1 1 1 1 1 1 1 1 1 1 1 1 1 1 1 1 1 1 1 1
symmnumber: 1
zpe: 1041238.9 jmol-1
zpe.correction: 0.396587 hartree
zpe.thermalcorrener: 0.417517 hartree
zpe.thermalcorrenthalpy: 0.418461 hartree
zpe.thermalcorrgfe: 0.343468 hartree
zpe.sumelectzpe: -754.428151 hartree
zpe.sumelectthermal: -754.407221 hartree
zpe.sumelectthermalent: -754.406277 hartree
zpe.sumelectthermalfe: -754.481270 hartree
dipole: 3.2102 3.8640 1.3174
dipole: 5.1934
quadrupole: -118.0898 -116.8602 -109.1026
quadrupole: -15.6572 -0.9410 -2.6014
quadrupole: -3.4056 -2.1760 5.5816 -15.6572 -0.9410 -2.6014
hfenergy: -754.8247379 hartree
pointgroup: C01 [X(C16H27N1O1)]
dipole: -0.8946275 1.4789851 -1.0895345 debye
polarizability: 209.7489621|4.7172471|177.6804628|18.4059619|-20.2088095|159.9906834 unknown
InChI: InChI=1S/C16H27NO/c1-14(2)8-7-9-15(3)11-13-17-12-6-4-5-10-16(17)18/h8,11H,4-7,9-10,12-13H2,1-3H3
charge 0 multiplicity 1
45 atoms
O  3.032695 -2.387209 1.617892
N  1.653733 -0.959269 0.394021
C  2.320843 0.793725 -1.324844
C  3.668357 1.358557 -0.818116
C  1.356382 0.369027 -0.189742
C  4.4955 0.393098 0.063425
C  3.777253 -0.071996 1.3629
C  2.792692 -1.227152 1.145976
C  0.71585 -2.077628 0.087884
C  -0.673636 -1.805743 0.622335
C  -1.838075 -1.698231 -0.082446
C  -3.143718 -1.392421 0.644446
C  -3.843321 -0.07774 0.169464
C  -1.954367 -1.86472 -1.587896
C  -2.961797 1.143156 0.340631
C  -2.702314 2.135842 -0.559268
C  -1.776675 3.289055 -0.200248
C  -3.287543 2.211127 -1.959637
H  1.818505 1.572924 -1.933171
H  2.492126 -0.073546 -1.993045
H  3.465094 2.281896 -0.234964
H  4.282517 1.667403 -1.687179
H  1.359978 1.144194 0.603685
H  0.3197 0.321142 -0.566596
H  5.433167 0.906314 0.353216
H  4.795228 -0.498425 -0.522339
H  3.271297 0.795312 1.833539
H  4.518349 -0.455716 2.083384
H  1.157662 -2.968223 0.572003
H  0.705932 -2.252694 -1.004644
H  -0.712013 -1.666409 1.713229
H  -2.951023 -1.321156 1.732404
H  -3.859402 -2.229353 0.499191
H  -4.767292 0.041532 0.774066
H  -4.176719 -0.188581 -0.878424
H  -1.00969 -2.171046 -2.065116
H  -2.281197 -0.919249 -2.063367
H  -2.718478 -2.627706 -1.835173
H  -2.47314 1.214662 1.326263
H  -2.301519 4.262252 -0.27814
H  -1.382541 3.194025 0.826663
H  -0.915056 3.340835 -0.897149
H  -2.482848 2.289502 -2.717909
H  -3.912229 3.119971 -2.071113
H  -3.915866 1.342261 -2.215291
