program: Gaussian 09
title: 000163970
version: EM64L-G09RevD.01
frameworkgroup: C1[X(C6H16N2O)]
method: RPBEPBE
basis: SDD
operation: Freq
keyword: #p
keyword: freq=noraman
keyword: PBEPBE/SDD
title: #p freq=noraman PBEPBE/SDD
converged: NO YES NO NO
title: Mulliken charges:
elementType: O N N C C C C C C H H H H H H H H H H H H H H H H
charge: -0.289906 -0.591252 -0.597728 0.440605 -0.495001 -0.483149 -0.365326 -0.792852 -0.498534 0.186058 0.245798 0.213943 0.238754 0.218147 0.183847 0.226547 0.196067 0.242636 0.275501 0.268470 0.267278 0.279902 0.201460 0.198960 0.229775
chargesum: 0.00000
title: Mulliken charges with hydrogens summed into heavy atoms:
elementType: O N N C C C C C C
charge: -0.289906 -0.047281 -0.050548 0.440605 -0.063145 -0.030451 0.036668 -0.127603 0.131661
polarizability: 9.58255608e+01 5.34599153e-01 8.07065436e+01 6.62449635e-01 -1.68324002e+00 7.37844249e+01
1716.lowfreq: -15.9763 -12.3432 0.0007 0.0009 0.0009 10.7090 64.1950 85.0628 106.9980
frequency: 64.1124 85.0259 106.9921 129.8619 156.1518 197.1065 225.3262 249.4149 257.9296 264.8196 295.6346 315.7003 335.8694 360.5773 394.0362 505.3435 558.6564 620.5238 688.6177 772.8041 840.2205 881.3574 902.3746 926.4591 956.8370 967.4641 1051.2739 1068.5866 1081.0638 1087.7940 1111.9416 1124.5347 1148.9678 1192.6304 1217.1325 1231.7279 1263.1552 1320.4565 1324.8943 1359.8863 1362.7150 1367.6383 1385.2002 1434.6429 1456.6152 1462.7727 1468.2608 1471.6100 1476.3850 1482.7884 1490.4606 1630.5186 1640.3160 2864.8952 2911.8411 2921.8141 2940.4783 2966.8179 2972.0616 2990.0261 3026.9943 3040.2779 3059.0122 3082.0893 3094.6537 3451.0917 3477.6177 3577.3890 3601.8996
redmass: 2.9136 2.6189 2.5906 2.9619 2.0351 1.0937 1.2543 1.6929 2.3135 1.6308 1.4031 1.4965 2.8227 2.7116 3.1228 2.5611 1.7694 1.6840 1.3678 2.6460 1.6713 2.8839 2.4408 1.7656 1.4004 1.4711 5.2702 1.5255 2.2194 3.0503 1.4355 1.5104 1.5115 1.3043 2.4290 1.9932 1.4966 1.3053 1.2949 1.3034 1.3841 1.3743 1.2725 1.1432 1.0516 1.0694 1.0774 1.0803 1.0617 1.0599 1.0677 1.0919 1.0936 1.0696 1.0503 1.0404 1.0661 1.0384 1.1024 1.1024 1.0895 1.0960 1.0969 1.0991 1.0971 1.0452 1.0449 1.0970 1.0981
irintensity: 0.0491 14.9198 0.5429 0.9763 5.3664 15.3899 5.9292 1.5295 6.4653 7.1445 61.6849 26.6968 1.7234 1.1749 2.4401 12.9101 96.3282 97.8429 163.4905 17.7818 7.4110 11.2289 2.7454 12.2962 5.0343 1.7969 133.0729 17.9097 32.0984 13.7567 0.5021 0.2398 5.7472 4.2886 1.9423 12.0511 2.7033 5.9038 0.5224 9.1753 4.1151 5.5984 16.5782 1.1138 11.2779 18.7675 5.7764 2.0090 1.6951 1.4271 24.5203 45.1612 40.8697 97.0540 48.4585 130.2826 63.5986 25.1347 73.0368 66.8860 17.7425 15.9528 41.4076 24.2086 33.6992 1.7865 0.5057 1.4430 1.2809
temp: 298.150 k
press: 1.00000 atm
elementType: 8 7 7 6 6 6 6 6 6 1 1 1 1 1 1 1 1 1 1 1 1 1 1 1 1
symmnumber: 1
zpe: 584687.7 jmol-1
zpe.correction: 0.222696 hartree
zpe.thermalcorrener: 0.234930 hartree
zpe.thermalcorrenthalpy: 0.235874 hartree
zpe.thermalcorrgfe: 0.185505 hartree
zpe.sumelectzpe: -422.144862 hartree
zpe.sumelectthermal: -422.132628 hartree
zpe.sumelectthermalent: -422.131684 hartree
zpe.sumelectthermalfe: -422.182053 hartree
dipole: -0.2459 -0.5557 -1.2880
dipole: 1.4242
quadrupole: -48.5816 -53.2394 -58.8435
quadrupole: -1.5682 0.2718 1.8840
quadrupole: 4.9732 0.3155 -5.2887 -1.5682 0.2718 1.8840
hfenergy: -422.3675579 hartree
pointgroup: C01 [X(C6H16N2O1)]
dipole: 0.1212105 0.2078889 -0.5060016 debye
dipolederiv: -1.1114765 0.0429838 0.0075603 0.0662499 -0.4400666 0.0066372 -0.0615383 -0.0009183 -0.396879 -0.6923133 0.0308721 0.0867139 0.0352023 -0.3612393 0.2151603 0.1362581 0.2317005 -0.5196447 -0.2611783 0.0724637 -0.0645542 0.0543265 -0.6044834 -0.0621917 -0.0899122 -0.1342572 -0.6652597 -0.0062075 0.0026318 -0.0106206 0.0101093 0.0083175 0.0380969 -0.0420527 0.0952177 -0.0085236 0.5700111 -0.0051741 -0.1179768 -0.04636 0.1842191 -0.08737 -0.0232049 -0.142733 0.2181628 0.1278832 -0.0322017 0.0096814 -0.022847 0.4824764 0.1562051 0.0547001 0.0772208 0.2772943 0.5718234 -0.0508361 0.1278203 -0.104482 0.3676421 0.0063921 0.2367593 -0.0347398 0.2806694 -0.0256268 0.004568 -0.0256036 -0.0019083 -0.0091583 -0.0935976 -0.0075259 -0.0597218 -0.0382048 0.7012377 0.0273121 -0.0985135 0.0633148 0.3372789 0.0304599 -0.2385655 0.04019 0.3023085 -0.0827043 -0.0513266 0.0978171 -0.0766811 -0.1216551 0.1923764 0.0794617 0.1378788 -0.10338 0.0474491 -0.0381339 0.0106988 -0.0465554 0.0045131 -0.1435237 0.0255953 -0.1021766 0.0040785 0.0167806 0.0112299 -0.147949 0.0251926 -0.0244676 -0.0503453 -0.1047081 -0.0425242 -0.19429 -0.0782885 -0.0595467 0.1055298 -0.0611868 0.065906 -0.0278755 0.0659871 -0.0461832 0.0659049 -0.0019244 0.0502374 -0.0031695 0.0447629 -0.0140715 -0.1475027 -0.069269 -0.090017 -0.1263516 -0.0243973 -0.0678607 0.0132096 -0.0170691 -0.196258 0.1229652 -0.0478656 0.0801146 0.0101368 -0.071895 0.0139724 0.1513381 -0.0097334 0.0806562 0.0178527 0.1264091 -0.0130195 0.0109614 0.0874189 0.0025628 0.0064215 0.0115547 -0.1675054 0.0682231 0.0016227 0.1312556 0.0192952 -0.0292052 -0.0241377 -0.1399798 0.0027721 0.0888697 0.0220543 -0.1253293 -0.0091302 0.0072238 0.0519172 0.0114564 -0.0654202 0.0621774 0.2469866 -0.0786034 -0.1450458 -0.1024021 0.1493495 0.1573991 -0.0032256 0.0278263 0.0467777 0.0302655 -0.112802 0.0328981 -0.0660531 0.2844731 0.1631278 -0.0352953 0.0839676 -0.0576504 -0.0075466 0.0088495 0.1110679 0.1010809 0.2529851 0.0327753 0.0816776 0.0045942 0.0667771 0.1891435 -0.0660446 -0.0411611 -0.0282185 0.2690608 -0.0317329 -0.0195823 0.0204636 -0.1415974 -0.1957427 0.0679169 0.1064129 0.0628726 0.0478794 -0.0174353 -0.0137869 -0.001098 0.0257222 -0.0235166 -0.1354774 0.1446142 -0.1414694 -0.1392808 -0.0934383 0.0491396 -0.0787573 0.0711314 0.0794364 0.0521443 -0.125608 0.0560326 -0.0079692 unknown
polarizability: 95.7365752|-1.2596281|80.7777168|-0.4997791|1.7842403|73.8022373 unknown
InChI: InChI=1S/C6H16N2O/c1-6(3-7,4-8)5-9-2/h3-5,7-8H2,1-2H3
charge 0 multiplicity 1
25 atoms
O  1.941951 -0.147459 0.244851
N  -2.927107 0.635722 -0.371536
N  -0.34474 -2.234462 -0.058889
C  -0.473191 0.277861 0.092064
C  -1.593791 0.4553 -0.977213
C  -0.675581 -1.087559 0.816142
C  0.871843 0.296512 -0.664096
C  -0.507446 1.413908 1.141647
C  3.26212 -0.033345 -0.366383
H  -1.307245 1.292003 -1.661911
H  -1.610202 -0.475647 -1.575302
H  -0.080536 -1.077335 1.754784
H  -1.746558 -1.139128 1.086665
H  0.824874 -0.388152 -1.539212
H  1.093706 1.326062 -1.027908
H  -1.406242 1.3306 1.779802
H  -0.515986 2.410755 0.657409
H  0.383964 1.358103 1.791406
H  -3.704424 0.311658 -0.951494
H  -3.097746 1.566795 0.017465
H  -0.875945 -3.08499 0.147873
H  0.664873 -2.414399 -0.090516
H  3.499926 1.020773 -0.62704
H  3.34309 -0.650014 -1.288127
H  3.986793 -0.396162 0.38032
