program: Gaussian 09
title: 000163947
version: EM64L-G09RevD.01
frameworkgroup: C1[X(C10H12BrN5O2)]
method: RPBEPBE
basis: SDD
operation: Freq
keyword: #p
keyword: freq=noraman
keyword: PBEPBE/SDD
title: #p freq=noraman PBEPBE/SDD
converged: YES YES NO NO
title: Mulliken charges:
elementType: Br O O N N N N N C C C C C C C C C C H H H H H H H H H H H H
charge: 0.016878 -0.297579 -0.433586 -0.215689 -0.077927 0.034049 0.022541 -0.609182 -0.045082 -0.488337 -0.484554 -0.050483 -0.333116 0.169509 -0.203925 -0.111424 0.181499 -0.375099 0.279746 0.309469 0.236315 0.250805 0.230659 0.246850 0.199716 0.223898 0.283828 0.349326 0.340860 0.350037
chargesum: 0.00000
title: Mulliken charges with hydrogens summed into heavy atoms:
elementType: Br O O N N N N N C C C C C C C C C C
charge: 0.016878 -0.297579 -0.084260 -0.215689 -0.077927 0.034049 0.022541 0.081716 0.234664 0.057447 -0.003090 0.196367 0.090498 0.169509 0.079903 -0.111424 0.181499 -0.375099
polarizability: 2.19830770e+02 -9.87925159e+00 1.80726230e+02 1.28884214e+01 5.87986937e+00 9.47712292e+01
1716.lowfreq: -6.2592 -0.0003 -0.0003 0.0003 5.6762 6.3365 21.6419 36.0770 63.8367
frequency: 18.6240 35.8936 63.7217 84.8628 101.1568 113.0117 141.0669 196.7287 207.5617 225.2410 245.0878 256.8357 284.2671 301.3647 339.7285 389.7023 397.7284 427.6583 444.4394 515.9186 535.8210 549.4442 578.3899 586.7662 611.8784 630.0032 657.1680 660.7087 683.7851 734.3117 744.9117 780.4401 792.5147 845.4429 865.7458 869.2319 913.6096 929.4335 958.0514 965.8059 979.7278 999.9846 1030.9034 1039.5935 1083.9860 1104.8144 1143.2032 1161.2041 1169.4738 1189.0479 1193.5947 1219.8542 1250.3030 1264.0094 1287.0044 1296.3235 1300.9532 1318.9545 1325.8513 1332.1932 1342.4740 1343.7891 1381.4239 1383.9240 1418.0022 1452.1633 1457.2789 1471.4147 1479.8295 1530.8937 1577.9626 1633.3337 2957.6743 3010.4785 3026.5191 3027.0102 3053.0795 3071.5198 3092.6005 3107.9385 3259.6999 3537.1451 3549.8296 3691.0741
redmass: 5.9127 6.8873 4.3993 7.0806 6.9780 4.2370 3.9150 4.8305 5.3846 3.6320 7.3245 4.1108 5.0643 6.9053 6.7067 2.9721 3.0720 1.5784 2.0561 8.9004 1.2469 1.0724 3.0801 4.0399 3.3136 5.1461 8.9735 10.6334 5.7882 7.9069 4.1558 5.1338 7.9783 1.4352 7.0650 1.8096 2.2914 2.2850 1.9661 5.1100 3.5480 3.0853 3.8766 2.5305 2.0868 1.9883 3.2525 1.6058 1.5298 1.4982 1.6967 2.2171 2.3235 1.4176 1.6057 4.3723 1.5331 1.2750 1.3659 1.4309 7.4311 1.3161 7.1185 1.3506 4.8675 4.3635 1.0867 1.0907 1.1122 6.9563 1.9972 2.5243 1.0679 1.0663 1.0841 1.0639 1.0875 1.0962 1.1000 1.1043 1.0981 1.0445 1.0657 1.1057
irintensity: 1.2891 1.4688 2.0661 4.3431 1.2665 7.2679 3.3872 4.3102 5.3244 1.9957 4.1671 1.2703 0.1329 1.4295 1.7468 13.5866 13.0578 112.0522 11.8554 11.7931 255.5500 4.1766 9.7290 8.5269 9.4147 37.1859 2.2603 17.2272 25.3971 23.9630 25.0977 17.7000 9.8206 16.5775 46.8828 7.8069 39.7694 13.7618 8.7654 159.4401 66.7020 8.5397 90.3563 58.1245 1.0904 10.6522 62.9183 32.6559 132.7826 19.8088 10.6393 114.3829 107.5983 4.4572 115.2485 133.6916 19.8249 0.9741 3.5520 63.1983 69.0008 21.7149 47.8871 29.0319 25.9087 43.0856 3.6298 15.0752 23.5470 158.3768 58.9200 618.4840 50.1789 14.5093 29.1211 28.8856 27.8924 26.9675 39.4089 4.9368 1.5887 145.1186 7.3388 54.8619
temp: 298.150 k
press: 1.00000 atm
elementType: 35 8 8 7 7 7 7 7 6 6 6 6 6 6 6 6 6 6 1 1 1 1 1 1 1 1 1 1 1 1
symmnumber: 1
zpe: 593539.8 jmol-1
zpe.correction: 0.226067 hartree
zpe.thermalcorrener: 0.242181 hartree
zpe.thermalcorrenthalpy: 0.243125 hartree
zpe.thermalcorrgfe: 0.180222 hartree
zpe.sumelectzpe: -824.597458 hartree
zpe.sumelectthermal: -824.581345 hartree
zpe.sumelectthermalent: -824.580400 hartree
zpe.sumelectthermalfe: -824.643304 hartree
dipole: -1.1403 0.4614 0.0781
dipole: 1.2326
quadrupole: -137.2812 -100.4074 -112.1740
quadrupole: 17.4267 3.3535 0.4345
quadrupole: -20.6603 16.2135 4.4469 17.4267 3.3535 0.4345
hfenergy: -824.8235259 hartree
pointgroup: C01 [X(C10H12Br1N5O2)]
dipole: -0.3798668 0.2740848 -0.125479 debye
polarizability: 206.9994918|-7.4791773|175.7725384|31.4178587|-32.140151|112.5561989 unknown
InChI: InChI=1S/C10H12BrN5O2/c11-10-14-8(12)7-9(15-10)16(4-13-7)6-2-1-5(3-17)18-6/h4-6,17H,1-3,12H2
charge 0 multiplicity 1
30 atoms
Br 3.600913 -2.444859 1.812662
O  -2.807844 -0.439742 -0.973888
O  -4.907486 1.47887 -0.370045
N  -0.474244 -0.006719 -0.583646
N  0.55586 2.033386 -0.863416
N  1.39731 -1.2262 0.546422
N  3.366513 0.195589 0.853378
N  3.455432 2.447103 0.149518
C  -1.510568 -1.074528 -0.780498
C  -1.663628 -1.97711 0.457373
C  -2.630563 -1.15727 1.348482
C  -3.58282 -0.493167 0.332113
C  -4.025645 0.934199 0.664132
C  0.810891 -0.13649 -0.04046
C  -0.560449 1.311301 -1.072588
C  1.423113 1.135826 -0.219072
C  2.758981 1.278222 0.260292
C  2.658006 -0.951817 0.950432
H  -1.267621 -1.620114 -1.708183
H  -0.698662 -2.207941 0.933226
H  -2.139857 -2.920123 0.135104
H  -3.174908 -1.795538 2.062701
H  -2.074602 -0.392152 1.922118
H  -4.469913 -1.117422 0.116467
H  -3.129078 1.573716 0.812707
H  -4.625701 0.939779 1.590412
H  -1.460491 1.672695 -1.560965
H  -4.452222 1.368457 -1.244407
H  4.408844 2.49387 0.503641
H  3.018539 3.254879 -0.290212
