program: Gaussian 09
title: 000013366
version: EM64L-G09RevD.01
frameworkgroup: C1[X(C10H18Cl2N2O2S2)]
method: RPBEPBE
basis: SDD
operation: Freq
keyword: #p
keyword: freq=noraman
keyword: PBEPBE/SDD
title: #p freq=noraman PBEPBE/SDD
converged: YES YES NO NO
title: Mulliken charges:
elementType: Cl Cl S S O O N N C C C C C C C C C C H H H H H H H H H H H H H H H H H H
charge: -0.117658 -0.112038 0.224382 0.230232 -0.260746 -0.258499 -0.363563 -0.362326 -0.372302 -0.374945 0.295029 0.290041 -0.809306 -0.808397 -0.618328 -0.640013 -0.521995 -0.511063 0.253629 0.253513 0.251301 0.256461 0.314972 0.318474 0.269173 0.291638 0.265441 0.293943 0.283914 0.276075 0.295722 0.288957 0.295050 0.309022 0.282376 0.291834
chargesum: 0.00000
title: Mulliken charges with hydrogens summed into heavy atoms:
elementType: Cl Cl S S O O N N C C C C C C C C C C
charge: -0.117658 -0.112038 0.224382 0.230232 -0.260746 -0.258499 -0.048592 -0.043852 0.134841 0.132817 0.295029 0.290041 -0.248495 -0.249013 -0.058339 -0.055334 0.082077 0.063147
polarizability: 2.29071626e+02 1.63067614e+00 1.60724055e+02 2.04056985e+01 -8.45879316e-01 1.64203973e+02
1716.lowfreq: 0.0013 0.0025 0.0028 2.6991 5.5425 7.5669 23.4705 35.8485 41.0847
frequency: 22.7266 35.4781 41.0388 51.0221 52.5998 66.1700 69.8339 86.0147 92.8476 104.2463 110.5491 124.9886 127.2086 174.5054 178.1175 198.3755 206.4491 238.7850 251.7390 257.0291 263.6806 300.9740 313.5336 326.1174 371.3180 407.9091 478.2552 550.5619 572.6711 578.0687 586.4816 644.0374 652.6406 669.9763 679.0477 689.7832 694.9165 733.4072 744.7574 754.2201 762.1067 825.6225 848.5869 876.2091 884.1598 905.7405 945.1127 961.9160 966.4917 1065.5011 1068.5323 1072.7872 1081.9937 1099.4729 1108.1479 1113.8796 1145.9670 1160.4352 1217.8809 1223.7607 1235.1118 1239.8203 1246.0255 1258.5288 1260.2918 1276.7779 1282.2086 1283.4667 1285.7822 1305.9533 1343.4468 1368.9873 1424.1934 1437.7473 1447.3069 1448.4434 1448.8478 1452.7909 1456.1723 1458.1744 1500.3764 1508.4983 1611.7644 1615.3702 3012.4914 3020.8749 3028.7428 3029.6817 3045.4049 3049.8192 3070.8260 3083.7457 3084.7577 3100.1831 3105.3000 3109.0562 3120.7296 3120.9074 3165.1684 3175.1568 3460.2829 3465.6873
redmass: 12.2374 9.2882 8.5244 8.4963 8.4422 3.8687 6.6965 8.0271 4.4405 4.8974 4.0162 2.8958 2.6823 4.5314 4.3726 5.6242 5.8075 5.0276 7.4621 6.1719 3.3134 3.0452 3.8789 4.9016 3.4620 2.6715 2.6333 4.7177 7.6075 5.6725 4.4187 1.1534 4.0565 4.2011 4.9490 1.1847 4.8211 4.1890 4.8850 1.1983 1.1815 2.9655 2.6438 2.6017 1.9356 2.2842 2.6493 1.4808 1.4694 3.8529 4.3514 2.8619 2.3375 1.7568 1.4328 1.0832 1.3117 1.3165 1.1454 1.1792 1.2847 1.2668 1.1924 1.1724 1.2069 1.2170 1.4706 1.4130 1.6332 1.1827 1.2522 1.2521 1.1234 1.1235 1.1491 1.1057 1.1344 1.1037 1.1081 1.0974 1.6249 1.6124 5.8314 5.6024 1.0611 1.0615 1.0582 1.0576 1.0591 1.0593 1.0567 1.0574 1.1027 1.1026 1.1067 1.1061 1.1072 1.1071 1.1124 1.1127 1.0805 1.0806
irintensity: 0.9450 1.3313 2.0997 5.5415 3.2878 3.7413 1.9423 1.6937 2.2346 0.3244 1.3968 7.7582 5.0527 15.9422 2.7095 10.2255 11.5000 0.0825 4.0671 1.9982 12.8493 1.5090 0.2836 0.3402 2.7648 9.6126 2.6052 0.8044 15.7484 74.3373 172.9000 94.4991 6.3419 1.7758 3.0484 58.2639 8.7996 3.7693 1.4214 5.3637 4.7093 4.0882 2.4872 1.6464 0.8380 0.9146 13.3280 2.7088 5.5036 5.7122 6.2445 8.1327 0.3721 2.6710 1.1350 4.0483 54.5166 31.8117 6.0013 9.3379 28.2125 1.4833 12.9773 0.4490 3.3246 1.8720 13.5064 53.0296 22.0727 23.2206 3.6692 14.6108 28.5999 28.0607 15.5001 21.3389 20.1667 24.5804 18.2250 10.4478 96.2054 181.5696 157.4173 156.0394 14.0160 27.7852 11.5573 14.0179 3.8269 5.1389 4.1066 5.5211 7.0901 12.8892 4.5498 3.5504 1.5571 1.4320 3.4468 2.5291 207.6437 174.5518
temp: 298.150 k
press: 1.00000 atm
elementType: 17 17 16 16 8 8 7 7 6 6 6 6 6 6 6 6 6 6 1 1 1 1 1 1 1 1 1 1 1 1 1 1 1 1 1 1
symmnumber: 1
zpe: 737385.9 jmol-1
zpe.correction: 0.280855 hartree
zpe.thermalcorrener: 0.302950 hartree
zpe.thermalcorrenthalpy: 0.303894 hartree
zpe.thermalcorrgfe: 0.226526 hartree
zpe.sumelectzpe: -2366.657755 hartree
zpe.sumelectthermal: -2366.635661 hartree
zpe.sumelectthermalent: -2366.634717 hartree
zpe.sumelectthermalfe: -2366.712085 hartree
dipole: -0.2753 -2.6828 0.6446
dipole: 2.7728
quadrupole: -159.1141 -145.4976 -133.3417
quadrupole: -0.0456 3.9010 2.0328
quadrupole: -13.1297 0.4868 12.6428 -0.0456 3.9010 2.0328
hfenergy: -2366.9386109 hartree
pointgroup: C01 [X(C10H18Cl2N2O2S2)]
dipole: 0.1582425 -1.0593153 0.2071545 debye
polarizability: 224.3655682|10.576566|163.0148961|24.2684425|3.9464987|166.6191902 unknown
InChI: InChI=1S/C10H18Cl2N2O2S2/c11-1-5-17-7-9(15)13-3-4-14-10(16)8-18-6-2-12/h13-14H,1-8H2
charge 0 multiplicity 1
36 atoms
Cl 0.742725 -2.10528 -2.211224
Cl -0.339124 -1.446355 2.725365
S  4.051801 -0.921984 0.679175
S  -3.996348 -1.497561 0.001289
O  2.783509 2.13134 -0.134807
O  -3.103891 1.639675 -0.670876
N  0.895006 1.314092 0.947353
N  -1.089725 0.714437 -1.374018
C  -0.011943 2.279648 0.301406
C  -0.336745 1.964992 -1.180219
C  2.260207 1.353782 0.722664
C  -2.450139 0.653928 -1.132571
C  3.086258 0.417774 1.61374
C  -3.093932 -0.695573 -1.470713
C  2.59725 -1.87648 -0.081448
C  -2.823222 -1.068696 1.422974
C  2.349684 -1.312574 -1.471821
C  -1.598201 -1.963807 1.346895
H  0.465804 3.276473 0.326932
H  -0.951137 2.32476 0.877337
H  0.601057 1.913483 -1.757922
H  -0.943146 2.803955 -1.568341
H  0.509589 0.64513 1.623361
H  -0.602855 -0.108238 -1.7477
H  2.478465 -0.080139 2.38728
H  3.879425 1.012451 2.096981
H  -2.370207 -1.414187 -1.888225
H  -3.903897 -0.529276 -2.200497
H  2.888934 -2.937571 -0.108889
H  1.728064 -1.760909 0.585957
H  -2.58202 0.003852 1.359769
H  -3.405935 -1.247404 2.340332
H  3.133494 -1.574507 -2.195667
H  2.160031 -0.231093 -1.477147
H  -1.029723 -1.860758 0.410938
H  -1.814216 -3.018378 1.566738
