program: Gaussian 09
title: 000163806
version: EM64L-G09RevD.01
frameworkgroup: C1[X(C15H20O2)]
method: RPBEPBE
basis: SDD
operation: Freq
keyword: #pfreq=noraman
keyword: PBEPBE/SDD
title: #p freq=noraman PBEPBE/SDD
converged: YES YES NO NO
title: Mulliken charges:
elementType: O O C C C C C C C C C C C C C C C H H H H H H H H H H H H H H H H H H H H
charge: -0.181818 -0.197404 0.266286 0.123006 -0.142784 -0.652635 -0.173991 -0.550459 0.389605 -0.528239 0.392731 -0.779976 -0.469683 -0.175178 -0.762143 -0.746673 -0.216687 0.236822 0.248751 0.254148 0.245907 0.215698 0.234959 0.209365 0.231402 0.231666 0.213065 0.233389 0.227381 0.155867 0.212637 0.214312 0.215912 0.213061 0.224559 0.215803 0.171338
chargesum: 0.00000
title: Mulliken charges with hydrogens summed into heavy atoms:
elementType: O O C C C C C C C C C C C C C C C
charge: -0.181818 -0.197404 0.266286 0.123006 0.094038 -0.149736 0.071916 -0.099802 0.389605 -0.087472 0.392731 -0.101855 -0.242302 -0.019311 -0.119282 -0.093249 -0.045350
polarizability: 2.10127739e+02 7.87016746e-01 1.49509532e+02 -6.02347347e+00 5.66433176e+00 1.28033104e+02
1716.lowfreq: -0.0007 -0.0005 -0.0004 4.9963 10.8214 18.3337 36.8330 55.1239 89.8234
frequency: 36.5720 54.9930 89.8088 98.9967 138.9473 146.1221 157.3085 185.4658 201.7752 210.0035 216.9499 238.7620 278.7175 288.9654 292.8534 312.9251 355.7784 364.1137 390.7128 402.3729 407.5629 449.7439 475.1895 518.6319 536.0605 575.5730 623.2529 628.2107 650.2455 723.5867 756.4947 774.1495 794.3727 845.7775 870.6976 902.2940 911.4292 920.2641 923.3652 936.7271 944.4784 960.3414 971.9460 978.0490 986.0351 1006.4791 1028.5467 1038.5966 1053.2999 1071.0629 1079.2452 1091.2799 1111.7619 1156.2915 1179.5294 1196.7254 1211.5133 1226.0642 1241.8593 1250.7070 1261.8377 1282.4924 1291.9652 1304.9611 1315.2372 1340.3387 1358.4545 1365.4896 1378.1118 1382.2126 1395.7195 1398.4581 1415.1768 1456.0705 1461.6290 1463.4539 1466.7901 1474.7562 1480.2383 1482.3779 1484.4539 1487.1530 1597.8751 1622.2648 1650.0684 2866.3703 2871.4491 2948.8773 2966.3148 2971.7262 2978.9369 2982.1311 2989.4607 2993.6766 3049.5191 3053.9552 3061.5772 3064.7972 3066.2101 3068.4700 3069.0023 3078.4505 3082.2447 3084.5557 3183.4257
redmass: 3.0961 5.5069 3.3660 5.5151 3.7146 6.2783 4.5305 1.8313 1.1980 1.5087 2.0398 1.4624 2.1077 2.0804 2.1175 2.9397 2.9424 2.9422 2.6811 2.3535 2.7479 2.5322 3.1958 4.3210 3.3670 3.9508 3.4183 3.8408 3.2727 3.8143 3.6862 3.5759 3.5564 2.7596 1.5090 1.6473 1.8612 1.6432 1.5807 1.3816 1.7795 1.7098 1.7622 1.8043 1.7472 1.8998 1.7026 2.4773 1.3900 2.6234 1.5186 1.5855 2.0899 1.6926 3.1028 1.8992 2.4845 2.0627 1.7017 1.5231 1.7128 1.3228 2.0467 1.7559 1.9201 1.7989 1.6130 1.5331 1.2126 1.2854 1.2058 1.2088 1.9618 1.1752 1.0876 1.0610 1.0626 1.0505 1.0940 1.0668 1.0710 1.0604 8.4295 8.6737 8.0845 1.0848 1.0855 1.0818 1.0354 1.0364 1.0367 1.0601 1.0611 1.0847 1.1027 1.1026 1.0995 1.0999 1.0991 1.0987 1.0984 1.0592 1.0891 1.0968 1.1145
irintensity: 0.2494 6.6472 7.7325 3.4916 1.5647 2.3907 7.3447 4.4474 0.5871 3.3374 4.1184 2.4642 0.4729 3.0763 1.5042 1.3732 0.5337 3.5424 1.6631 0.8171 0.6627 0.6934 3.1964 3.0828 3.6744 2.1743 7.9692 3.4727 6.1005 27.7826 2.9286 3.1327 31.2423 25.6111 9.1023 7.0547 2.1301 0.2556 23.7373 1.7114 10.9591 3.6361 1.3046 4.6687 2.4232 2.4696 0.9755 35.4941 3.8509 7.7926 4.5140 24.3802 0.1384 8.5690 2.7965 1.2496 27.0625 5.6379 11.3257 0.2517 8.5777 4.4970 33.6380 4.0786 5.3673 3.8798 7.5942 3.0787 23.6925 13.5537 13.0348 15.0796 28.0208 10.7078 4.6615 0.3773 6.9413 4.7094 4.9281 13.2479 9.3420 13.5969 148.6393 249.7766 63.5653 126.5682 100.6639 7.9928 33.9119 34.0448 21.9547 33.5742 29.4803 19.9451 13.3813 15.1765 4.0477 48.2312 17.1352 67.6694 75.0649 10.5587 21.4077 29.8412 9.8134
temp: 298.150 k
press: 1.00000 atm
elementType: 8 8 6 6 6 6 6 6 6 6 6 6 6 6 6 6 6 1 1 1 1 1 1 1 1 1 1 1 1 1 1 1 1 1 1 1 1
symmnumber: 1
zpe: 816560.9 jmol-1
zpe.correction: 0.311012 hartree
zpe.thermalcorrener: 0.328031 hartree
zpe.thermalcorrenthalpy: 0.328975 hartree
zpe.thermalcorrgfe: 0.267380 hartree
zpe.sumelectzpe: -732.693690 hartree
zpe.sumelectthermal: -732.676671 hartree
zpe.sumelectthermalent: -732.675726 hartree
zpe.sumelectthermalfe: -732.737321 hartree
dipole: 7.2056 0.6463 0.4363
dipole: 7.2477
quadrupole: -128.9400 -95.0962 -103.7942
quadrupole: -5.0565 -3.8771 5.3068
quadrupole: -19.6632 14.1806 5.4826 -5.0565 -3.8771 5.3068
hfenergy: -733.0047014 hartree
pointgroup: C01 [X(C15H20O2)]
dipole: -2.8377694 0.2406211 -0.1411394 debye
polarizability: 210.0222314|-0.3269976|149.7456634|-6.725992|-5.2142842|127.90248 unknown
InChI: InChI=1S/C15H20O2/c1-13(2)5-10-4-11(7-16)15(9-17)8-14(15,3)12(10)6-13/h4,7,9-10,12H,5-6,8H2,1-3H3
charge 0 multiplicity 1
37 atoms
O  3.636381 0.798806 0.995772
O  3.626614 -1.644798 -0.87725
C  0.321158 1.289459 -0.115988
C  1.603235 0.384901 -0.280295
C  -0.920127 0.691531 0.579628
C  0.765076 0.841441 -1.503406
C  -0.960629 -0.866281 0.787405
C  -2.241366 1.040086 -0.191481
C  -3.161181 -0.218544 -0.118456
C  -2.117317 -1.374499 -0.135101
C  1.487372 -1.053704 0.11372
C  0.515956 2.768637 0.236383
C  0.329099 -1.605214 0.587645
C  2.919267 1.053431 -0.001954
C  -4.129128 -0.300306 -1.320658
C  -3.977295 -0.22772 1.202013
C  2.620232 -1.962416 -0.188825
H  -0.945984 1.159376 1.582797
H  1.207942 1.595997 -2.164592
H  0.211109 0.05537 -2.025716
H  -1.28496 -1.060854 1.831542
H  -2.741635 1.936666 0.217776
H  -1.998729 1.253488 -1.250481
H  -1.739593 -1.519775 -1.166727
H  -2.539457 -2.337158 0.207968
H  0.748747 2.896466 1.309911
H  1.32798 3.240262 -0.343506
H  -0.41369 3.327458 0.020618
H  0.314217 -2.684853 0.804529
H  3.213875 1.849097 -0.73336
H  -3.576849 -0.308987 -2.279231
H  -4.746166 -1.217637 -1.275269
H  -4.81786 0.565489 -1.334278
H  -4.547104 -1.170127 1.307756
H  -3.332674 -0.119075 2.09358
H  -4.701397 0.608354 1.213498
H  2.503684 -2.999769 0.216431
