program: Gaussian 09
title: 000164125
version: EM64L-G09RevD.01
frameworkgroup: C1[X(C20H22N4O6)]
method: RPBEPBE
basis: SDD
operation: Freq
keyword: #p
keyword: freq=noraman
keyword: PBEPBE/SDD
title: #p freq=noraman PBEPBE/SDD
converged: YES YES NO NO
title: Mulliken charges:
elementType: O O O O O O N N N N C C C C C C C C C C C C C C C C C C C C H H H H H H H H H H H H H H H H H H H H H H
charge: -0.299126 -0.281679 -0.272637 -0.278741 -0.289719 -0.302526 -0.448770 -0.482704 -0.079388 -0.373658 -0.426170 0.137442 0.137367 0.587787 0.230623 0.197526 -0.538701 -0.445732 0.349434 -0.021907 0.129071 0.089318 -0.759446 -0.764734 -0.347192 0.098654 -0.502481 -0.498845 0.284484 -0.490366 0.299260 0.287835 0.244291 0.264894 0.262196 0.269701 0.190513 0.186831 0.268264 0.273915 0.243903 0.364644 0.364886 0.223378 0.240348 0.244062 0.238463 0.232100 0.234985 0.244275 0.238518 0.245556
chargesum: 0.00000
title: Mulliken charges with hydrogens summed into heavy atoms:
elementType: O O O O O O N N N N C C C C C C C C C C C C C C C C C C C C
charge: -0.299126 -0.281679 -0.272637 -0.278741 -0.289719 -0.302526 -0.160935 -0.118060 -0.079388 -0.008773 -0.126910 0.137442 0.137367 0.587787 0.230623 0.197526 -0.294410 -0.180838 0.349434 -0.021907 0.129071 0.089318 -0.037037 -0.035725 -0.103289 0.098654 0.205306 0.206703 0.284484 0.237984
polarizability: 3.45912463e+02 1.46731125e+01 2.56428378e+02 1.12872237e+01 1.93678271e+01 2.74436924e+02
1716.lowfreq: -6.0974 -3.9443 -3.3242 -0.0006 -0.0005 0.0002 10.2462 23.0577 31.3061
frequency: 9.7137 23.0095 31.2831 45.3108 47.6919 53.5341 61.5974 68.3232 77.2008 89.7300 91.9997 93.6965 101.4954 110.1439 115.6473 116.3163 125.6289 147.9485 150.1765 160.1857 176.2884 184.7119 207.5610 227.0328 253.1741 258.9264 286.3123 294.8629 300.7887 313.9044 323.1992 330.0718 345.6121 351.7363 371.6826 382.9158 402.8123 436.9013 440.6389 481.3311 545.2041 558.9452 571.1910 584.4746 598.8739 607.0223 615.0166 645.8672 652.4881 671.6165 673.9936 681.0370 703.3127 710.7251 730.7195 734.4977 737.5515 744.6130 752.4512 772.6457 783.5401 808.9615 836.5922 845.8592 875.2311 905.2014 911.7758 915.3542 946.3299 968.5878 972.6571 980.9116 1008.5715 1027.0033 1033.9494 1039.6357 1047.6990 1051.1075 1102.8658 1111.3948 1112.9696 1113.9795 1119.4081 1132.7184 1141.8373 1145.3014 1152.3475 1159.3141 1180.6442 1211.5136 1216.1630 1229.3174 1244.9833 1269.8491 1271.3691 1304.5626 1307.7975 1321.9260 1330.3227 1390.7352 1400.7495 1405.6182 1410.9862 1421.3531 1423.2409 1432.9149 1439.9532 1444.5390 1448.0885 1450.4366 1451.0929 1452.9408 1463.4467 1464.6801 1465.4207 1465.8142 1469.8627 1471.2100 1476.0584 1490.2473 1566.4231 1580.4507 1586.6574 1597.7242 1627.1721 1631.3571 1646.6605 1653.5715 2986.1531 2990.1164 2999.3092 3000.7707 3006.8698 3055.9008 3078.3963 3082.7752 3098.3267 3101.4693 3102.0319 3109.1681 3109.6795 3138.5483 3143.6182 3145.1015 3149.4680 3152.8175 3170.1067 3523.3947 3551.0756 3560.5186
redmass: 5.2780 4.6204 4.6596 5.1464 3.8918 3.8157 1.5187 2.4085 2.7054 2.1138 4.1669 1.4823 2.7127 1.8228 2.1884 1.5481 1.2640 2.8983 3.8327 4.1080 4.1903 4.4524 4.6687 5.8600 5.3952 5.2899 5.6050 5.8077 4.5154 3.9137 4.3099 4.1523 5.9299 5.6210 6.6966 5.1642 6.2232 3.0157 6.4116 5.1518 5.9809 4.5184 3.5708 2.8031 2.8968 2.6288 4.6616 3.9278 1.3906 7.3810 6.0750 6.1380 3.7029 7.5145 6.5031 7.1772 5.1590 1.1811 5.2275 3.5528 4.5499 4.2632 3.3774 2.0057 1.8330 7.2332 6.4422 6.3455 3.6730 1.3705 1.6196 6.1165 5.0350 1.7302 1.5048 1.5331 4.5472 7.3555 3.9592 1.2625 2.2869 1.2994 1.2528 1.8787 1.4460 1.4829 1.4970 2.8279 2.6248 2.1240 2.2213 1.5783 4.1918 4.9215 1.5208 2.1456 2.4478 3.0079 2.5561 2.9612 2.5305 1.2384 1.1753 1.2058 1.2114 1.5543 1.0602 1.0487 1.0511 3.6753 1.0553 1.0495 1.0967 1.1041 1.2558 1.1411 1.4667 1.9525 1.3359 2.9027 5.1429 8.5616 8.3675 7.2627 7.3930 4.1929 9.0472 7.4533 1.0399 1.0400 1.0297 1.0292 1.0297 1.0837 1.0976 1.0972 1.1040 1.0964 1.1043 1.0968 1.1051 1.1048 1.1042 1.0912 1.0882 1.1046 1.0970 1.0823 1.0772 1.0773
irintensity: 0.2795 0.1503 0.4562 0.5995 1.2930 3.1522 0.4820 1.1587 0.3101 1.6652 2.8471 0.2560 0.3705 3.3093 0.7530 1.3312 0.4543 7.9743 4.7608 4.2047 0.2210 1.2714 3.0400 13.8516 16.4952 20.9555 0.7437 11.9397 4.1994 3.6094 7.1280 17.4718 7.5691 10.2703 4.7130 3.0784 0.3568 3.0916 4.5786 9.8368 5.3627 2.9256 7.6401 9.8191 18.0880 22.4213 2.0175 11.7810 66.2217 6.2145 7.5916 2.5067 55.2451 22.9311 8.1120 7.5091 0.9106 85.1694 24.3412 0.3610 38.6698 11.7195 5.9819 13.3029 11.2194 4.5010 8.1133 7.1089 1.3864 0.9065 12.8293 31.5381 258.8819 15.9194 17.7221 10.5773 54.4444 179.3010 151.2590 0.2817 31.4805 2.2173 0.2856 44.9166 52.9561 56.3368 119.9658 34.1580 380.4076 211.6514 179.1879 27.4097 31.6932 122.8586 13.3227 33.7243 64.5259 46.3576 5.3848 95.2962 66.4254 99.0532 20.4887 34.2653 23.8237 57.9805 29.0557 19.1643 10.7875 35.6281 16.3976 14.8255 34.4538 71.9992 42.8829 36.9173 131.8588 35.3687 174.1263 56.5524 430.8551 221.3694 220.0950 195.3384 88.8894 24.9185 165.4521 291.5813 27.0302 36.4427 50.6986 49.5000 46.1613 0.7348 14.5423 16.2339 27.8124 7.0800 26.9270 6.3132 25.5864 19.4799 13.4878 5.2488 2.7835 16.4702 7.8491 133.4633 39.0832 83.5495
temp: 298.150 k
press: 1.00000 atm
elementType: 8 8 8 8 8 8 7 7 7 7 6 6 6 6 6 6 6 6 6 6 6 6 6 6 6 6 6 6 6 6 1 1 1 1 1 1 1 1 1 1 1 1 1 1 1 1 1 1 1 1 1 1
symmnumber: 1
zpe: 1052761.1 jmol-1
zpe.correction: 0.400976 hartree
zpe.thermalcorrener: 0.431276 hartree
zpe.thermalcorrenthalpy: 0.432221 hartree
zpe.thermalcorrgfe: 0.336335 hartree
zpe.sumelectzpe: -1443.524632 hartree
zpe.sumelectthermal: -1443.494331 hartree
zpe.sumelectthermalent: -1443.493387 hartree
zpe.sumelectthermalfe: -1443.589272 hartree
dipole: 1.6018 -0.9097 5.7520
dipole: 6.0398
quadrupole: -136.7386 -172.9114 -158.6347
quadrupole: 9.0371 -1.4986 -7.5184
quadrupole: 19.3563 -16.8165 -2.5398 9.0371 -1.4986 -7.5184
hfenergy: -1443.9256077 hartree
pointgroup: C01 [X(C20H22N4O6)]
dipole: 0.5016169 -0.9622732 2.1139727 debye
polarizability: 333.8767761|24.8234255|252.973049|21.138479|15.9506756|289.9279406 unknown
InChI: InChI=1S/C20H22N4O6/c1-9-14(17(25)28-3)16(15(10(2)21-9)18(26)29-4)11-6-7-12-13(8-11)23-19(22-12)24-20(27)30-5/h6-8,16,21,23-24H,1-5H3
charge 0 multiplicity 1
52 atoms
O  -3.054469 -3.650251 -0.993013
O  -2.673443 2.646786 -1.20252
O  -2.865162 -1.91997 -2.538332
O  -3.041222 3.39356 0.974719
O  7.022885 0.850251 1.320654
O  4.884584 0.850399 2.311222
N  -2.620698 -0.768019 2.113113
N  2.814467 0.488643 0.519605
N  3.487218 0.229995 -1.661623
N  5.206498 0.55797 -0.003088
C  -2.188193 0.034016 -0.572458
C  -2.587934 -1.405192 -0.191053
C  -2.596882 1.020454 0.523163
C  -0.676825 0.105024 -0.890599
C  -2.682204 -1.778056 1.138827
C  -2.715775 0.604312 1.837561
C  0.275488 0.295545 0.139096
C  -0.245806 -0.053581 -2.244839
C  1.633224 0.317522 -0.226652
C  2.073415 0.157269 -1.585976
C  -2.833028 -2.296643 -1.33347
C  -2.792894 2.438105 0.182963
C  -2.893385 -3.167188 1.70505
C  -2.985526 1.477933 3.043046
C  1.115316 -0.030101 -2.606671
C  3.866041 0.426225 -0.389771
C  -3.299104 -4.543831 -2.147832
C  -2.847518 4.044048 -1.64862
C  5.631808 0.760163 1.296142
C  7.612696 1.068913 2.660377
H  -2.720688 0.291151 -1.50251
H  -2.677075 -1.055022 3.090939
H  -0.043673 0.435872 1.176734
H  -1.010553 -0.208021 -3.01269
H  -3.882114 -3.565012 1.42059
H  -2.150957 -3.873759 1.303757
H  -2.821387 -3.157971 2.80889
H  -2.922669 0.892026 3.979561
H  -3.986992 1.937596 2.979443
H  -2.278525 2.32125 3.091487
H  1.431936 -0.148517 -3.647129
H  2.951759 0.638083 1.522629
H  5.89826 0.500266 -0.753174
H  -3.428002 -5.543033 -1.706564
H  -4.205049 -4.230495 -2.693832
H  -2.440214 -4.522159 -2.839686
H  -2.086698 4.693534 -1.183267
H  -2.720773 4.006339 -2.739882
H  -3.850435 4.415198 -1.375989
H  7.365001 0.227752 3.32909
H  8.694936 1.125033 2.479978
H  7.233741 2.007887 3.097003
