program: Gaussian 09
title: 000163783
version: EM64L-G09RevD.01
frameworkgroup: C1[X(C8H9Cl3N2)]
method: RPBEPBE
basis: SDD
operation: Freq
keyword: #p
keyword: freq=noraman
keyword: PBEPBE/SDD
title: #p freq=noraman PBEPBE/SDD
converged: YES YES NO NO
title: Mulliken charges:
elementType: Cl Cl Cl N N C C C C C C C C H H H H H H H H H
charge: -0.061797 -0.005171 0.011694 0.003720 0.003415 0.139546 0.642482 -0.612343 -0.684893 -0.726516 -0.231476 -0.440870 -0.273431 0.267655 0.286843 0.231156 0.241745 0.221265 0.222524 0.245427 0.228480 0.290543
chargesum: 0.00000
title: Mulliken charges with hydrogens summed into heavy atoms:
elementType: Cl Cl Cl N N C C C C C C C C
charge: -0.061797 -0.005171 0.011694 0.003720 0.003415 0.139546 0.642482 -0.057845 0.009274 -0.030084 0.059067 -0.440870 -0.273431
polarizability: 1.61227940e+02 1.83707798e+01 1.23806310e+02 9.40605289e+00 -4.68837906e+00 9.23839475e+01
1716.lowfreq: -10.2449 -4.9693 -0.0022 -0.0016 -0.0010 5.9317 41.4208 52.9815 73.3603
frequency: 41.4051 52.9642 73.3581 147.7963 160.1166 177.9358 190.9331 210.8361 245.7787 293.7286 315.0199 331.5779 343.5228 346.8758 351.6220 412.4442 447.0588 469.4347 521.7985 533.7538 612.7585 647.4873 689.1731 750.7075 786.8109 855.7548 902.5185 910.9280 939.4657 957.3372 997.5486 1009.1121 1031.8333 1098.7194 1109.5684 1137.4432 1159.5351 1209.0530 1247.4005 1275.3798 1293.9125 1327.0934 1379.4837 1399.8628 1446.5974 1448.1758 1467.8555 1475.4292 1489.0904 1500.5989 1533.3100 2988.6295 2992.8168 3063.2129 3082.1288 3087.7926 3094.8582 3115.5157 3155.0040 3209.4882
redmass: 9.8592 13.0232 13.4713 4.1399 5.5432 2.4948 1.2693 7.6947 4.0289 4.1407 20.0735 1.1687 4.0162 3.6892 3.3454 3.6632 6.3823 4.5923 3.5047 6.3503 8.0743 7.7452 5.8842 5.5186 5.6490 2.7279 1.8077 1.4985 1.5263 1.7027 7.2393 1.3647 4.9611 1.7304 2.1658 2.6810 3.4150 3.0203 2.7829 1.3445 2.1663 3.1665 1.1778 1.1857 1.1024 7.6803 1.0775 1.0563 1.0545 1.0583 5.6488 1.0359 1.0363 1.0589 1.1000 1.0987 1.1004 1.0991 1.1088 1.0924
irintensity: 1.1182 1.8682 1.1228 2.8167 0.0298 1.6541 0.2506 2.0375 1.6846 3.1953 0.2629 0.4232 0.9467 0.7860 3.1465 0.2751 8.1439 1.1542 4.0960 41.0625 5.8042 2.1630 29.6003 0.9101 2.7196 20.0867 10.9624 8.0834 5.6575 11.1953 5.0590 3.9393 16.6349 56.7475 115.6242 21.8282 3.7620 3.2838 20.8369 44.7236 97.5220 41.5839 20.7113 27.5898 5.7188 4.8430 6.2688 2.6010 11.0120 19.1573 51.2758 10.7636 29.1199 18.0038 0.0455 53.9571 15.8918 7.7750 2.1513 0.3065
temp: 298.150 k
press: 1.00000 atm
elementType: 17 17 17 7 7 6 6 6 6 6 6 6 6 1 1 1 1 1 1 1 1 1
symmnumber: 1
zpe: 410004.2 jmol-1
zpe.correction: 0.156162 hartree
zpe.thermalcorrener: 0.169623 hartree
zpe.thermalcorrenthalpy: 0.170567 hartree
zpe.thermalcorrgfe: 0.115061 hartree
zpe.sumelectzpe: -1798.908865 hartree
zpe.sumelectthermal: -1798.895405 hartree
zpe.sumelectthermalent: -1798.894460 hartree
zpe.sumelectthermalfe: -1798.949966 hartree
dipole: 3.7654 -3.2825 3.9983
dipole: 6.3983
quadrupole: -101.4942 -105.0567 -98.5007
quadrupole: 6.1653 2.8034 -1.6427
quadrupole: 0.1897 -3.3728 3.1831 6.1653 2.8034 -1.6427
hfenergy: -1799.0650273 hartree
pointgroup: C01 [X(C8H9Cl3N2)]
dipole: -1.835466 -1.1672035 -1.2670908 debye
dipolederiv: -0.1978369 0.0177529 -0.0439926 -0.0096146 -0.2092253 0.1407285 0.0428644 0.0978051 -0.5442242 -0.4931053 0.3368146 0.0149073 0.3705457 -0.4799543 -0.0148638 0.0048752 -0.0169892 -0.0713943 -0.5617355 0.3714128 -0.0045802 0.4555753 -0.4425881 -0.0041507 -0.0025812 -0.0084854 -0.0470337 -0.352854 0.3833228 0.0398098 -0.2514012 -0.1427388 -0.0182656 -0.0490717 0.0495191 -0.1711968 -0.188293 -0.1205748 -0.0138192 0.4939896 -0.3913083 0.0229509 0.0587536 -0.0453692 -0.166207 0.0679446 0.0926874 -0.0806024 0.1548997 0.1165067 0.1145354 0.0000716 0.0413324 -0.0509539 0.294286 0.2341271 0.0466785 0.1533909 -0.1349968 -0.0257425 0.0449254 -0.0028492 0.011282 0.1261752 -0.0415694 0.0649507 -0.0811992 0.1131496 -0.2031001 -0.0734473 -0.2117837 0.6900001 -0.053882 -0.0333088 0.0598083 -0.0779982 -0.0285102 -0.0692641 0.0375871 0.0435654 -0.0418009 -0.020638 -0.0345627 -0.0038445 -0.0163682 -0.087752 0.0014009 -0.005405 -0.0163692 0.0074791 -0.4107519 0.0935629 -0.0207876 0.1647419 -0.0799048 0.0101198 -0.0369646 -0.0109795 -0.0128799 0.6666342 -0.7504516 -0.0605204 -0.5211639 0.6661934 0.0296239 -0.0161733 0.0008271 0.0774989 0.9263465 -0.5541755 0.0176634 -0.8611469 0.8055543 -0.0035874 0.0063747 0.0298052 0.093999 -0.0970068 -0.042613 -0.0397686 -0.0775508 0.0627875 0.0385557 -0.0447202 0.0316672 -0.0161345 0.1536953 0.0284982 -0.0338564 0.0854422 -0.0212347 -0.0269297 -0.0349809 0.0166966 -0.0222007 0.0385365 0.0441631 0.1055785 0.0377087 0.0741942 -0.0352832 0.0769538 -0.0049892 -0.0749556 0.1309845 0.0088014 0.0068366 0.0410272 -0.0819013 0.0352166 0.0412042 -0.0194861 0.1052224 -0.1412137 -0.0680073 -0.065817 -0.0855484 0.0723089 -0.009274 -0.0534248 -0.0000645 0.0825396 0.0248883 0.054799 0.121261 0.0244483 0.0615487 -0.0298266 0.1112829 -0.0395802 -0.0546666 0.0796843 0.0670199 -0.0589203 0.0359403 0.035111 0.0630704 -0.0661986 0.0914722 -0.0076972 -0.1435109 -0.091091 -0.0521786 -0.022622 0.0773403 -0.0012229 -0.0374423 -0.0179638 0.097026 0.1516524 0.0033921 0.0011936 -0.0130966 0.01542 -0.0146915 -0.0044832 -0.0077811 0.116298 unknown
polarizability: 154.6609524|-22.7973287|132.3680325|7.1450932|-0.1847693|90.3892129 unknown
InChI: InChI=1S/C8H9Cl3N2/c1-8(2,4-9)5-3-6(10)12-13-7(5)11/h3H,4H2,1-2H3
charge 0 multiplicity 1
22 atoms
Cl -1.995292 -0.927485 2.303266
Cl -0.888844 2.732369 0.086691
Cl 3.592344 -1.671069 0.023912
N  1.551343 1.735125 0.226849
N  2.579659 0.81376 0.222937
C  -1.597207 -0.49086 -0.498941
C  -0.150472 -0.020109 -0.226119
C  -2.537373 -0.122579 0.678077
C  -2.150768 0.212622 -1.783879
C  -1.670144 -2.022265 -0.738344
C  0.918376 -0.942365 -0.210623
C  0.280595 1.326626 0.016876
C  2.233192 -0.475749 0.012844
H  -3.550728 -0.508061 0.488071
H  -2.56387 0.953979 0.889522
H  -1.521909 -0.048516 -2.653291
H  -2.17784 1.309528 -1.691329
H  -3.176499 -0.145404 -1.986936
H  -1.076115 -2.323121 -1.619871
H  -1.335555 -2.597575 0.141873
H  -2.719597 -2.302951 -0.93711
H  0.744405 -2.007199 -0.362876
