program: Gaussian 09
title: 000164038
version: EM64L-G09RevD.01
frameworkgroup: C1[X(C22H22Br4N10O2)]
method: RPBEPBE
basis: SDD
operation: Freq
keyword: #p
keyword: freq=noraman
keyword: PBEPBE/SDD
title: #p freq=noraman PBEPBE/SDD
converged: YES YES NO NO
title: Mulliken charges:
elementType: Br Br Br Br O O N N N N N N N N N N C C C C C C C C C C C C C C C C C C C C C C H H H H H H H H H H H H H H H H H H H H H H
charge: 0.057996 0.098370 0.023660 0.053405 -0.274028 -0.324160 -0.365328 -0.376027 -0.458313 -0.508837 -0.181112 -0.115591 -0.611452 -0.615315 -0.417445 -0.402738 -0.107984 -0.113103 -0.335718 -0.264754 -0.493611 -0.457852 0.468843 0.402451 -0.517532 -0.480477 0.149512 0.085027 0.158764 0.224351 0.184050 0.204507 -0.299326 -0.282589 -0.169043 -0.159922 -0.091092 -0.087478 0.256884 0.259694 0.260081 0.207919 0.251632 0.231760 0.240784 0.243379 0.327850 0.303756 0.311735 0.374707 0.283318 0.250525 0.314264 0.353074 0.304698 0.325741 0.381061 0.340124 0.290308 0.286596
chargesum: 0.00000
title: Mulliken charges with hydrogens summed into heavy atoms:
elementType: Br Br Br Br O O N N N N N N N N N N C C C C C C C C C C C C C C C C C C C C C C
charge: 0.057996 0.098370 0.023660 0.053405 -0.274028 -0.324160 -0.037478 -0.072272 -0.146578 -0.134130 -0.181112 -0.115591 0.055885 0.015125 -0.036384 -0.062614 0.148900 0.146591 -0.075637 -0.056834 -0.010219 0.026311 0.468843 0.402451 -0.234215 -0.229953 0.149512 0.085027 0.158764 0.224351 0.184050 0.204507 -0.009017 0.004008 -0.169043 -0.159922 -0.091092 -0.087478
polarizability: 6.06486028e+02 -2.16815049e+00 3.76514111e+02 2.96489435e+01 -3.52005849e+00 2.19491901e+02
1716.lowfreq: -7.8557 -1.8621 -0.0004 0.0003 0.0006 2.6680 6.2021 8.1753 9.4320
frequency: 6.1623 7.7289 9.2246 16.5312 20.4565 24.6440 33.5173 39.1813 46.4736 47.4656 59.5504 63.1573 76.5375 85.7438 90.5228 99.3418 99.9998 105.5450 115.1917 138.6976 147.0306 148.5779 180.0458 184.2751 188.4077 196.5312 204.6601 222.9558 227.9043 247.4116 250.8783 258.8826 264.8596 271.2211 277.8464 286.9658 293.3685 298.9573 308.8570 340.2894 346.0738 382.4636 384.4388 392.7311 404.4123 409.1349 427.6855 455.8551 468.8419 483.1076 486.4739 498.2095 501.9132 515.1235 528.2019 530.6677 545.3965 576.1637 585.1020 588.9942 608.9125 618.3922 618.5526 623.6998 631.8612 658.4624 686.1261 694.2876 699.0742 707.2057 718.7372 721.1874 738.0897 754.2738 779.9058 788.8608 807.5898 809.8008 839.1019 843.7031 856.5098 880.2395 883.6725 889.8576 928.1628 933.3295 939.1695 948.2686 957.5700 969.5583 984.3583 995.3371 1005.6490 1010.2287 1017.9847 1023.7539 1028.9598 1039.4784 1048.1584 1080.2355 1086.9884 1103.8613 1111.0902 1125.5852 1142.5109 1166.7480 1173.7988 1177.5935 1178.8109 1189.9956 1191.1212 1212.5856 1220.5780 1227.6874 1228.8621 1249.0357 1254.2125 1258.5230 1266.8464 1278.7622 1308.8023 1312.8854 1317.3093 1319.3313 1327.4187 1347.3092 1353.5050 1354.0768 1356.2101 1360.0419 1367.9826 1387.6456 1401.2660 1418.9623 1425.4826 1428.8000 1433.8040 1439.1706 1441.4177 1450.3552 1488.6293 1490.8659 1553.0642 1554.2793 1559.9099 1564.2882 1577.3166 1581.4434 1587.2718 1592.4218 1628.0813 1636.3918 2924.1973 2974.3080 2992.5925 2995.2778 3005.3293 3016.4816 3059.8110 3062.7173 3145.5428 3214.1288 3218.1345 3242.6257 3243.1386 3314.4420 3531.9652 3536.2942 3552.1885 3552.4409 3584.4356 3586.5849 3692.1048 3695.5930
redmass: 13.6476 12.4983 15.6166 14.8930 7.9685 9.8590 7.3646 10.4389 7.3876 8.6721 7.4167 8.2199 5.7509 6.0382 9.2214 28.9287 6.2236 10.3090 8.6211 6.6009 6.3251 6.5409 6.2920 5.2939 9.6407 5.9540 5.9511 5.5412 5.6889 1.2292 3.8674 1.1520 5.3540 5.0330 6.0780 7.2346 6.7986 3.9323 4.2515 4.7994 6.7902 3.9576 4.6545 6.6539 3.4203 3.9756 2.9925 4.3688 1.3635 2.3179 1.4715 4.5725 4.1187 5.5527 2.7979 1.3081 1.4529 1.4292 1.2090 2.5958 4.7212 6.8910 7.0935 3.9114 3.9479 4.2549 6.0210 7.6967 6.1323 6.0756 5.7275 5.7005 3.0126 3.2541 3.8233 3.5580 1.4554 1.5180 1.4773 1.4914 3.2483 1.3866 1.3020 1.9738 5.4774 6.8449 5.1081 7.3552 4.6637 3.6232 4.0909 3.3388 2.8141 2.6300 2.3172 2.6913 2.2472 2.9259 2.5946 2.3202 2.6759 1.7105 1.8270 1.7592 2.0330 2.3932 2.1530 1.5721 1.5588 2.1570 2.1783 1.1973 1.7281 1.6593 1.8316 1.4051 3.3449 1.7795 1.7946 1.2679 1.8994 2.0527 1.6203 2.1482 1.6574 3.1438 3.0822 3.4079 2.5513 1.4497 1.9210 2.4021 3.2832 4.4717 3.6416 4.7547 4.1917 1.2766 2.5552 1.1720 1.8199 1.9669 5.6822 3.7145 4.2524 4.8454 4.8481 4.6298 2.3320 2.4065 1.6670 1.7255 1.0822 1.0820 1.0624 1.0632 1.0839 1.0842 1.1017 1.1023 1.0929 1.0986 1.0982 1.0991 1.0987 1.0887 1.0775 1.0777 1.0455 1.0450 1.0810 1.0810 1.1038 1.1030
irintensity: 0.1439 0.4820 2.5977 0.4877 2.9492 0.9207 0.9882 0.5388 0.8159 5.1459 2.9723 0.2387 7.0706 0.6052 4.5890 1.1505 15.0490 3.1549 14.7378 3.9998 13.1766 5.4842 2.4547 7.9281 1.8049 2.1997 5.1017 2.5076 2.3471 74.4349 15.9491 65.1333 0.7336 3.9716 0.9013 11.8069 12.6461 17.3841 1.9834 32.2964 3.2106 9.8733 8.2499 4.7653 12.7120 2.4565 19.5986 5.2893 194.6872 103.8679 269.7812 23.9719 59.5307 8.0176 4.8035 187.6857 56.7701 14.8360 130.7295 24.1953 3.5557 8.9916 15.0628 3.8896 14.0544 25.9588 6.4757 9.0985 13.0464 5.5248 23.1971 23.2046 9.8674 5.2007 8.4175 2.5334 14.2306 32.8742 1.5681 24.8673 23.1076 70.3167 205.7903 54.0399 24.3726 6.0126 83.8836 47.2635 30.8039 20.4409 10.4408 1.2779 2.8861 9.2598 2.3941 1.7642 1.4056 0.7629 3.9290 7.3633 10.0283 0.3928 2.4604 2.3235 2.1271 40.8522 37.8181 6.6252 20.5722 174.2048 13.7582 1.3611 7.4205 29.8260 11.4142 15.9674 0.4120 20.2126 4.5292 2.6340 166.0230 71.1984 50.2122 243.0396 14.1835 12.8435 0.1873 1.1463 17.5134 4.6751 12.8229 1.8617 33.9982 42.5680 27.7837 233.6577 28.6506 113.8613 151.2934 41.1847 447.2586 195.7892 74.5993 80.8522 121.0892 10.8189 193.8663 183.2510 115.4215 96.5876 382.6635 316.5469 46.8793 1.6787 24.4001 31.0521 14.4758 56.3794 7.6260 6.0196 1199.1854 5.0932 10.1138 1.5827 1.3861 733.3127 17.0666 41.7130 101.6194 34.2119 67.4354 29.4400 37.1779 33.3578
temp: 298.150 k
press: 1.00000 atm
elementType: 35 35 35 35 8 8 7 7 7 7 7 7 7 7 7 7 6 6 6 6 6 6 6 6 6 6 6 6 6 6 6 6 6 6 6 6 6 6 1 1 1 1 1 1 1 1 1 1 1 1 1 1 1 1 1 1 1 1 1 1
symmnumber: 1
zpe: 1146119.2 jmol-1
zpe.correction: 0.436534 hartree
zpe.thermalcorrener: 0.474405 hartree
zpe.thermalcorrenthalpy: 0.475349 hartree
zpe.thermalcorrgfe: 0.356125 hartree
zpe.sumelectzpe: -1600.594671 hartree
zpe.sumelectthermal: -1600.556800 hartree
zpe.sumelectthermalent: -1600.555856 hartree
zpe.sumelectthermalfe: -1600.675080 hartree
dipole: -4.8976 -1.7714 3.4336
dipole: 6.2381
quadrupole: -293.3468 -279.4756 -249.2685
quadrupole: 27.8812 8.7589 17.8142
quadrupole: -19.3165 -5.4453 24.7618 27.8812 8.7589 17.8142
hfenergy: -1601.031205 hartree
pointgroup: C01 [X(C22H22Br4N10O2)]
dipole: -1.9158423 -1.0048098 1.1590285 debye
polarizability: 600.0123287|16.7674514|377.0657413|52.6214414|15.0336703|225.4139692 unknown
InChI: InChI=1S/C22H22Br4N10O2/c23-9-1-11(33-17(9)25)19(37)29-3-7-8(4-30-20(38)12-2-10(24)18(26)34-12)16(14-6-32-22(28)36-14)15(7)13-5-31-21(27)35-13/h1-2,5-8,15-16,29-30,33-36H,3-4,27-28H2
charge 0 multiplicity 1
60 atoms
Br 8.110019 1.014062 0.398828
Br -7.740805 -4.843555 -1.159025
Br 9.050197 -2.615717 0.692462
Br -9.473574 -1.548674 -0.555591
O  3.228169 -3.21959 -0.258491
O  -3.938288 -0.255736 1.385198
N  2.943432 -1.153048 -1.292474
N  -2.9675 -1.903686 0.046076
N  2.32754 1.532644 1.441105
N  -2.972202 2.137754 0.346702
N  4.183835 2.138417 0.29334
N  -2.739523 3.959611 -0.988758
N  4.410142 1.852895 2.692002
N  -4.888317 3.63485 0.10749
N  5.654904 -0.414656 -0.19199
N  -5.641982 -3.059909 -0.268338
C  0.697684 -0.573613 -0.430416
C  -0.865869 -0.508915 -0.398043
C  0.710567 1.002121 -0.478511
C  -0.718078 0.978283 0.171497
C  1.493822 -1.339311 -1.498824
C  -1.573886 -1.601374 0.43323
C  1.925593 1.655472 0.0851
C  -1.665913 2.068636 -0.194979
C  3.0750 2.069756 -0.582665
C  -1.554986 3.196672 -1.011796
C  3.683816 1.834615 1.51844
C  -3.57085 3.279549 -0.164624
C  3.702419 -2.082215 -0.589261
C  -4.062688 -1.246815 0.584927
C  5.102731 -1.712416 -0.263911
C  -5.390783 -1.751666 0.190805
C  6.127467 -2.634762 0.0201
C  -6.610177 -1.053892 0.17369
C  6.998331 -0.529508 0.141903
C  -6.99749 -3.18762 -0.555351
C  7.318061 -1.891122 0.268548
C  -7.614567 -1.952442 -0.299636
H  1.064288 -0.901977 0.564339
H  -1.27922 -0.46588 -1.424902
H  0.604744 1.325509 -1.531867
H  -0.63264 0.887596 1.278093
H  1.300412 -2.42571 -1.43847
H  1.221404 -0.989803 -2.513149
H  -1.001887 -2.545997 0.35031
H  -1.585969 -1.312477 1.499912
H  3.351598 -0.252753 -1.55097
H  -3.108273 -2.508639 -0.766167
H  1.703343 1.331727 2.22093
H  -3.403262 1.376469 0.897602
H  3.189374 2.297604 -1.641281
H  -0.694983 3.530938 -1.588809
H  4.156596 1.273981 3.488239
H  5.367801 2.192231 2.629803
H  -5.32282 3.362841 0.985703
H  -5.217219 4.483851 -0.346239
H  5.162061 0.505999 -0.174165
H  -4.991245 -3.84419 -0.226279
H  6.004875 -3.715064 0.024572
H  -6.739234 -0.009554 0.447231
