program: Gaussian 09
title: 000163715
version: EM64L-G09RevD.01
frameworkgroup: C1[X(C11H8ClN3O3)]
method: RPBEPBE
basis: SDD
operation: Freq
keyword: #p
keyword: freq=noraman
keyword: PBEPBE/SDD
title: #p freq=noraman PBEPBE/SDD
converged: YES YES NO NO
title: Mulliken charges:
elementType: Cl O O O N N N C C C C C C C C C C C H H H H H H H H
charge: -0.055102 -0.261034 -0.418516 -0.304902 -0.328605 -0.012602 -0.624232 0.188414 0.529570 0.061431 -0.360131 -0.351883 -0.336119 0.155634 -0.070412 -0.193948 0.170595 -0.239228 0.295345 0.288967 0.258107 0.237074 0.260063 0.388030 0.331236 0.392250
chargesum: 0.00000
title: Mulliken charges with hydrogens summed into heavy atoms:
elementType: Cl O O O N N N C C C C C C C C C C C
charge: -0.055102 -0.261034 -0.026266 -0.304902 -0.328605 -0.012602 0.095034 0.188414 0.529570 0.061431 -0.064786 -0.062916 -0.078012 0.155634 -0.070412 0.043127 0.170595 0.020835
polarizability: 2.61280546e+02 -4.46526268e+00 1.59941623e+02 2.86043186e+00 9.41961980e+00 8.17575754e+01
1716.lowfreq: -7.9476 -0.0024 -0.0022 -0.0015 3.8881 5.5703 25.3337 36.5026 51.4994
frequency: 25.3059 36.4699 51.4951 89.1357 103.7845 137.3584 168.7263 204.4320 214.4278 225.2317 251.7549 291.3724 310.4307 365.1151 369.8070 399.8410 432.7548 449.8987 492.7885 548.2669 555.5054 589.6429 611.3230 632.3026 647.1725 650.1000 671.6926 675.6878 694.7334 724.1578 764.7918 773.6730 780.6048 834.3172 877.9326 881.0590 898.2666 949.5230 969.9701 985.6511 1003.6872 1037.3110 1071.9957 1098.7909 1120.4751 1126.3427 1176.1512 1178.7996 1203.9732 1281.0800 1287.5971 1323.5579 1370.5107 1374.9152 1386.3960 1422.1289 1436.5548 1470.1511 1502.3176 1585.9654 1594.0362 1605.4833 1619.7229 1658.0090 3152.7191 3175.5663 3186.1331 3191.0506 3239.6762 3246.8351 3531.9675 3598.7946
redmass: 8.3388 10.0421 7.2125 7.0600 8.3729 7.6372 7.0463 6.3190 6.3269 7.3364 7.3500 8.1274 5.2643 6.7554 8.6014 7.4846 3.8629 4.6291 6.2532 2.0940 4.5583 1.5694 2.8349 4.5004 4.3846 2.9349 3.2816 2.5732 4.6172 6.1609 6.8777 7.6037 1.4381 1.1032 1.4739 1.3930 1.3857 6.7672 1.3451 6.1375 6.5392 4.8975 1.9476 1.6605 2.6121 1.8644 1.4321 1.0927 4.1214 1.9456 1.6308 4.3557 5.4226 5.3565 10.0316 4.1252 3.9224 2.9238 7.1477 6.5490 4.2259 6.8151 5.9203 1.4866 1.0878 1.0935 1.0982 1.0944 1.0693 1.0987 1.0643 1.0873
irintensity: 0.1000 2.0683 0.6655 0.7426 3.8769 0.7543 1.0394 1.1724 3.2766 1.0357 9.6227 3.3540 4.2323 6.9076 4.1769 5.4226 2.8985 6.4372 12.7923 18.6583 3.6647 147.7261 72.5798 7.9350 15.4458 5.6297 40.3206 15.6894 9.1449 65.0633 23.2207 59.8217 47.0691 199.4748 26.6651 14.1916 0.4228 44.3833 0.1303 8.0770 151.2588 75.6303 19.6037 51.5357 120.7845 53.4585 14.9265 0.6373 37.9562 7.3034 6.6137 34.3856 81.8173 67.5040 27.7204 14.2173 57.5179 90.1971 183.0127 95.3098 107.6103 50.8482 629.4815 8.5839 6.3510 5.0147 3.1425 2.9111 337.6638 2.9852 82.5276 83.6784
temp: 298.150 k
press: 1.00000 atm
elementType: 17 8 8 8 7 7 7 6 6 6 6 6 6 6 6 6 6 6 1 1 1 1 1 1 1 1
symmnumber: 1
zpe: 470103.7 jmol-1
zpe.correction: 0.179053 hartree
zpe.thermalcorrener: 0.194449 hartree
zpe.thermalcorrenthalpy: 0.195394 hartree
zpe.thermalcorrgfe: 0.134605 hartree
zpe.sumelectzpe: -1272.702864 hartree
zpe.sumelectthermal: -1272.687468 hartree
zpe.sumelectthermalent: -1272.686524 hartree
zpe.sumelectthermalfe: -1272.747312 hartree
dipole: 3.5959 0.4641 1.6382
dipole: 3.9787
quadrupole: -95.8534 -105.9930 -111.4601
quadrupole: -9.4205 -4.6381 5.8512
quadrupole: 8.5821 -1.5575 -7.0246 -9.4205 -4.6381 5.8512
hfenergy: -1272.8819172 hartree
pointgroup: C01 [X(C11H8Cl1N3O3)]
dipole: -1.4187526 0.3498451 -0.5612333 debye
dipolederiv: -0.5745231 0.2855732 -0.1358708 0.3880914 -0.3674715 0.1452712 -0.1921112 0.1451161 -0.1391496 -0.9982141 0.0063744 -0.1168612 -0.1219194 -0.591275 -0.1976392 -0.0779182 -0.1664227 -0.4545539 -0.9414101 -0.521802 -0.0546556 -0.7936222 -0.8996891 -0.0432783 -0.0955298 -0.0527873 -0.4231021 -1.0963959 0.1595778 0.0814022 0.2399643 -0.965242 -0.1975887 0.1339315 -0.1268825 -0.3869512 -0.5827292 -0.1283939 -0.0149212 0.1299546 -0.0113588 0.0539157 0.0639258 0.0104217 -0.0444768 -0.405266 -0.0186229 0.0309908 0.1112455 -0.2034194 -0.0394361 -0.0130201 -0.0229046 -0.1847174 -1.0294427 0.1888977 0.0104638 0.3833057 -0.7260099 0.0491282 0.0529066 0.0584423 -0.5721327 0.8644744 0.0469044 -0.1228007 0.0701588 -0.3659947 -0.1737745 -0.1026318 -0.1698489 0.0108003 0.7381257 0.0924702 -0.0429241 0.1383316 0.1655827 -0.1142858 -0.0593966 -0.0548662 0.1277361 -1.3293842 -0.0531449 0.140797 -0.1364777 -0.1465074 -0.0233684 0.0924029 -0.0033511 -0.0608112 0.0812699 0.0331243 -0.0061566 -0.1418014 0.1458465 0.078606 0.0255069 0.0639768 -0.0465496 -0.3101738 0.1441381 -0.0609348 0.0821184 -0.1201975 0.0389959 -0.0240351 0.0412371 -0.1011773 -0.1209794 -0.1017358 0.0293119 -0.0750939 -0.0565862 -0.0156159 -0.03401 0.037419 -0.0999885 1.5056916 -0.2353575 0.1806288 -0.212914 1.0834945 0.4093902 0.1535989 0.3495863 0.4386959 0.7955436 -0.4983733 0.2381796 -0.6634372 0.4976043 -0.2596928 0.3524669 -0.2612396 0.0667336 0.034408 0.040037 0.0013194 0.0667215 0.0828961 -0.1049354 -0.0311682 -0.0929129 -0.0857864 2.3983382 0.1903746 -0.1707659 0.1968701 1.4121913 0.2360286 -0.2305905 0.1951373 0.3464247 -0.166932 0.1169241 -0.0476355 0.1641218 -0.182119 0.0394994 -0.0728188 0.0325567 -0.1290889 0.0939187 -0.0244125 0.0018006 -0.0300201 0.0705238 -0.0314659 0.0073761 -0.0246841 0.1591338 0.1360949 -0.0320343 0.0065199 -0.0417498 0.061221 0.0565447 0.0249888 0.0397376 0.1383037 0.006449 0.073421 -0.0477397 0.0747602 0.0579611 0.0446358 -0.0525268 0.0184474 0.1346221 0.0460123 -0.0248725 0.0150418 -0.0493235 -0.0341547 0.1001024 0.0134123 0.0935048 0.1094268 -0.040303 -0.0322236 0.0153041 -0.0232517 0.1115263 0.0281271 0.0124004 0.0251776 0.1552218 0.4236347 0.2201652 0.0718802 0.1112434 0.4443981 0.0225331 0.0621539 -0.0108531 0.3479885 0.1828434 -0.0350439 -0.0332151 -0.0574627 0.2419342 -0.0685887 -0.0395285 -0.0928167 0.3002592 0.2889492 0.108035 0.030841 0.190186 0.2948452 -0.0331088 0.0302147 -0.0311912 0.3931391 unknown
polarizability: 261.2847754|-3.2616457|160.9689111|-4.6979607|-1.4157135|80.7260584 unknown
InChI: InChI=1S/C11H8ClN3O3/c12-6-2-1-3-7(4-6)15-9(10(13)16)8(5-14-15)11(17)18/h1-5,17H,13H2
charge 0 multiplicity 1
26 atoms
Cl 5.087908 -1.75869 0.651638
O  0.16177 2.031889 1.403844
O  -4.288041 -1.664143 0.126991
O  -4.19203 0.601353 0.562928
N  0.080853 -0.465181 -0.082404
N  -0.211334 -1.783852 -0.478431
N  -2.125868 2.298861 1.081243
C  -1.053509 0.241313 0.304296
C  1.462079 -0.057696 -0.198882
C  -2.14172 -0.669183 0.120531
C  -1.552933 -1.88865 -0.343132
C  2.450873 -0.966522 0.239534
C  1.810662 1.166312 -0.809505
C  -0.951359 1.597198 0.969473
C  3.798986 -0.603491 0.079196
C  3.172853 1.496794 -0.953521
C  -3.577884 -0.475742 0.302793
C  4.185888 0.615794 -0.507827
H  -2.06201 -2.817539 -0.587974
H  2.163714 -1.921743 0.683969
H  1.037032 1.85299 -1.160531
H  3.453905 2.446436 -1.419001
H  5.243685 0.869354 -0.618579
H  -3.041688 1.88336 0.829413
H  -2.075729 3.196856 1.563642
H  -5.259404 -1.477777 0.233597
