program: Gaussian 09
title: 000163680
version: EM64L-G09RevD.01
frameworkgroup: C1[X(C9H14ClN3O)]
method: RPBEPBE
basis: SDD
operation: Freq
keyword: #p
keyword: freq=noraman
keyword: PBEPBE/SDD
title: #p freq=noraman PBEPBE/SDD
converged: YES YES NO NO
title: Mulliken charges:
elementType: Cl O N N N C C C C C C C C C H H H H H H H H H H H H H H
charge: 0.046763 -0.271886 -0.141792 -0.017331 -0.386583 0.276047 -0.675158 -0.673757 -0.698440 -0.219597 0.270794 -0.428785 0.195006 -0.609010 0.216604 0.233049 0.227823 0.230084 0.233982 0.215772 0.205019 0.235409 0.237384 0.260726 0.309696 0.277688 0.225570 0.224925
chargesum: 0.00000
title: Mulliken charges with hydrogens summed into heavy atoms:
elementType: Cl O N N N C C C C C C C C C
charge: 0.046763 -0.271886 -0.141792 -0.017331 -0.076888 0.276047 0.002318 0.006082 -0.020629 -0.219597 0.270794 -0.168060 0.195006 0.119173
polarizability: 1.75145784e+02 5.87580672e+00 1.34891012e+02 -1.28123048e+00 -1.62652266e+00 8.38126033e+01
1716.lowfreq: -7.5957 -0.0008 0.0010 0.0011 1.4885 6.3434 35.0912 52.7947 65.8880
frequency: 35.0409 52.7695 65.8874 98.9425 107.8286 142.8500 177.2064 184.3203 209.8454 225.1012 238.7424 263.6097 276.2866 293.1454 298.4826 340.9469 351.4496 390.8879 428.5737 445.6934 522.7078 533.6563 555.1021 597.8491 642.9349 649.0352 746.0907 779.1473 814.2578 836.3670 921.0070 927.7478 935.1481 957.2269 979.6279 1031.5567 1034.8909 1082.8193 1113.8961 1121.8077 1134.2595 1188.2636 1209.8185 1235.4905 1236.6523 1255.8154 1327.6740 1336.0921 1379.7152 1385.5774 1401.0104 1412.0551 1417.2946 1450.6834 1453.3859 1463.3150 1466.8717 1478.9067 1479.9246 1487.4053 1499.0095 1504.0092 1537.3009 1609.2088 2975.4111 2994.2325 2996.6792 3004.5074 3053.1621 3090.2767 3093.1068 3103.3523 3106.7959 3107.7912 3110.6865 3119.4757 3207.6049 3564.4947
redmass: 4.1146 4.8057 3.3347 3.3153 1.1915 3.1713 1.3137 7.8451 2.6004 3.3255 1.1246 4.6674 1.1014 3.8149 3.1914 3.6098 2.7007 4.3941 3.4145 3.3395 6.2191 3.2162 1.2814 4.2193 6.0663 8.4730 5.3726 4.0005 2.8930 1.4570 1.6797 2.0296 3.1231 1.2005 4.6511 1.6512 1.4070 5.4544 3.6387 1.2904 1.6274 1.8615 2.5172 3.0450 2.2267 3.6436 5.9194 6.9587 1.1928 1.2042 5.1956 1.2416 1.1954 1.0483 1.3579 1.0468 1.0486 1.0644 1.0566 1.0508 1.0671 1.6090 3.9813 7.0081 1.0350 1.0355 1.0360 1.0367 1.1023 1.1002 1.0998 1.0989 1.1003 1.0977 1.0995 1.1003 1.0972 1.0775
irintensity: 8.9120 0.5818 0.2544 2.4266 0.6195 0.5836 0.3226 0.4584 1.3248 0.2846 0.3455 2.7089 0.0103 3.8762 1.8122 16.5009 5.2962 5.5334 1.1896 4.7377 12.7590 15.4844 89.5958 9.3517 2.6209 1.4100 17.5061 6.5550 2.4868 21.0318 1.2191 6.1080 50.8476 0.0178 27.8743 5.7387 0.4120 0.9530 2.6116 0.1956 55.9510 17.9000 88.0499 20.7306 125.2320 16.2547 37.1864 55.6752 29.7158 29.4015 26.1589 15.6979 41.2953 1.5096 77.9726 1.8582 0.5100 12.0468 7.9507 16.1545 18.4535 21.4182 289.2756 158.2054 88.0668 24.8781 12.1180 26.6476 38.9199 10.1665 13.0818 61.5804 0.3766 1.7153 26.0545 22.9747 2.4320 15.1888
temp: 298.150 k
press: 1.00000 atm
elementType: 17 8 7 7 7 6 6 6 6 6 6 6 6 6 1 1 1 1 1 1 1 1 1 1 1 1 1 1
symmnumber: 1
zpe: 587891.6 jmol-1
zpe.correction: 0.223916 hartree
zpe.thermalcorrener: 0.239410 hartree
zpe.thermalcorrenthalpy: 0.240355 hartree
zpe.thermalcorrgfe: 0.180957 hartree
zpe.sumelectzpe: -1049.807183 hartree
zpe.sumelectthermal: -1049.791689 hartree
zpe.sumelectthermalent: -1049.790745 hartree
zpe.sumelectthermalfe: -1049.850143 hartree
dipole: 1.3886 -2.7206 1.4482
dipole: 3.3804
quadrupole: -74.4073 -94.2247 -91.4605
quadrupole: 14.1671 -4.0819 0.4662
quadrupole: 12.2902 -7.5272 -4.7630 14.1671 -4.0819 0.4662
hfenergy: -1050.0310995 hartree
pointgroup: C01 [X(C9H14Cl1N3O1)]
dipole: -0.5811804 1.068181 0.5384682 debye
polarizability: 174.7791376|6.7874083|135.2213883|2.9232827|0.8289752|83.8488737 unknown
InChI: InChI=1S/C9H14ClN3O/c1-9(2,3)13-7(10)6(5-12-13)8(14)11-4/h5,11H,1-4H3
charge 0 multiplicity 1
28 atoms
Cl -0.268819 -2.398573 0.311195
O  2.758686 -1.508213 -0.296413
N  -1.252629 0.220006 0.077042
N  -0.831753 1.550738 -0.045635
N  3.36178 0.618703 0.449678
C  -2.736585 -0.08675 0.114276
C  -3.079152 -0.763227 1.467585
C  -3.092114 -0.999085 -1.089105
C  -3.513045 1.245036 -0.004698
C  -0.157128 -0.625102 0.135565
C  1.017345 0.151394 0.064242
C  0.528047 1.490558 -0.047551
C  2.425371 -0.333611 0.054073
C  4.800331 0.337846 0.452257
H  -4.167478 -0.945126 1.513436
H  -2.565108 -1.7301 1.591897
H  -2.802784 -0.104081 2.309232
H  -2.820662 -0.506724 -2.039356
H  -2.581228 -1.974172 -1.039568
H  -4.181277 -1.181813 -1.092299
H  -4.593119 1.014068 0.021347
H  -3.27382 1.928796 0.825159
H  -3.282183 1.76638 -0.947186
H  1.090793 2.415208 -0.171728
H  3.03226 1.514203 0.811009
H  4.936474 -0.678513 0.049042
H  5.218262 0.370899 1.475925
H  5.351236 1.055656 -0.183618
