program: Gaussian 09
title: 000163858
version: EM64L-G09RevD.01
frameworkgroup: C1[X(C11H22Cl2N3O4PS)]
method: RPBEPBE
basis: SDD
operation: Freq
keyword: #p
keyword: freq=noraman
keyword: PBEPBE/SDD
title: #p freq=noraman PBEPBE/SDD
converged: YES YES NO NO
title: Mulliken charges:
elementType: Cl Cl S P O O O O N N N C C C C C C C C C C C H H H H H H H H H H H H H H H H H H H H H H
charge: -0.062945 -0.062339 0.092490 1.378634 -0.523584 -0.614424 -0.413149 -0.223117 -0.263073 -0.522266 -0.939449 -0.398044 -0.134280 -0.350781 -0.418868 -0.686072 -0.293789 0.147198 -0.278216 -0.301233 -0.565134 -0.564627 0.272312 0.253835 0.237200 0.232852 0.269931 0.238515 0.308968 0.245574 0.270401 0.226104 0.229586 0.236988 0.260516 0.226310 0.282091 0.372274 0.351168 0.262927 0.284789 0.255147 0.292601 0.386979
chargesum: 0.00000
title: Mulliken charges with hydrogens summed into heavy atoms:
elementType: Cl Cl S P O O O O N N N C C C C C C C C C C C
charge: -0.062945 -0.062339 0.092490 1.378634 -0.523584 -0.614424 -0.026171 -0.223117 0.045895 -0.522266 -0.216007 -0.125732 0.119556 0.119271 0.089578 -0.170097 0.161902 0.147198 0.219287 0.207168 -0.017417 -0.016878
polarizability: 2.61243541e+02 4.80504814e+00 2.03112920e+02 8.93970551e+00 -4.83156342e+00 1.75570502e+02
1716.lowfreq: -10.0988 -4.8597 -4.0507 -0.0020 -0.0016 -0.0012 4.4841 11.7443 22.9576
frequency: -2.5762 11.4474 22.7463 32.0659 37.9534 50.0600 56.1726 59.2520 74.6431 79.0955 86.2507 89.6475 94.4419 134.5026 162.3691 170.7923 180.7750 193.6787 211.6573 217.2439 227.8069 234.3025 240.9642 272.7724 285.3233 293.3674 305.6090 317.6524 339.5326 379.5893 382.8816 398.0169 416.7717 461.3248 484.9728 491.4839 510.4742 530.9242 548.3508 582.0419 600.2933 618.1459 623.7083 629.2756 660.5480 688.6072 693.9068 700.9015 772.2517 775.8948 807.4317 820.6581 835.8695 876.9249 928.1485 951.3159 955.7614 982.8896 997.5971 1001.2789 1019.5804 1024.5362 1037.6557 1044.1355 1045.7145 1051.8119 1063.5567 1065.7156 1099.4388 1118.5265 1120.2087 1140.1531 1162.4039 1196.3562 1207.3110 1217.0133 1229.8704 1234.5347 1249.6334 1251.4225 1259.2378 1270.0132 1285.0361 1289.8329 1292.5929 1309.0153 1331.0641 1333.6762 1334.7608 1353.9640 1365.7030 1366.8752 1385.0463 1437.6326 1442.2094 1447.3920 1452.4261 1461.1859 1462.1673 1469.5117 1470.2021 1475.1274 1560.6858 1665.4841 2990.8593 2992.0126 2998.9277 3001.2260 3004.2240 3004.8728 3010.4629 3013.1798 3053.2003 3054.4259 3063.1517 3063.1761 3073.0317 3081.8219 3083.6558 3092.3973 3142.2341 3155.4425 3473.4527 3514.9690 3532.5185 3679.5014
redmass: 8.7727 10.4509 7.5914 9.6237 11.9129 8.3608 7.7264 5.7627 4.9640 4.4688 4.4189 2.7304 2.5236 2.8288 4.4803 2.6877 3.7521 3.2720 7.4756 4.5654 2.1033 4.1360 6.8517 7.6041 4.4461 4.1710 3.0148 1.7698 4.2560 4.0655 4.2032 4.0232 4.1277 2.7381 4.2112 1.6344 3.9712 2.5268 3.1313 1.7528 2.8392 2.3545 3.8641 3.0373 6.6437 5.4220 3.5334 4.2213 1.1761 1.1827 1.2278 1.9594 5.5724 2.1490 3.8684 2.8245 2.3294 2.7112 2.1095 1.4475 2.3008 1.9703 2.1194 3.4501 3.4609 4.4485 2.0391 2.8315 2.6944 1.5675 2.1183 1.4130 1.5839 1.2904 2.5445 1.4408 1.5873 1.3536 1.4835 1.1713 1.1602 1.2391 1.1934 1.2292 1.1604 1.4436 1.3055 1.2232 1.3817 1.2249 1.3914 1.3083 1.5249 1.0917 1.0869 1.0843 1.0938 1.0854 1.0815 1.3017 1.0743 1.0876 1.0988 8.7338 1.0620 1.0596 1.0622 1.0830 1.0618 1.0636 1.0624 1.0839 1.0573 1.0998 1.0602 1.1020 1.0989 1.1045 1.1019 1.1031 1.1121 1.1118 1.0752 1.0641 1.0446 1.1017
irintensity: 0.0620 0.1053 0.2282 0.6978 0.6989 0.1730 0.8731 3.3972 0.0509 1.1849 7.4417 2.1496 0.0899 1.4724 1.2846 5.5926 6.9154 2.5963 0.7376 0.2391 1.8410 2.3883 20.3685 0.8020 10.1075 9.4051 29.1667 11.9758 8.4555 42.4052 0.9073 2.9336 27.8995 50.6875 55.4895 215.7748 52.0372 6.3863 10.1885 67.4870 84.8931 95.7858 13.0826 48.9202 47.4948 93.5925 73.4029 147.2330 6.0286 9.2732 17.1016 9.6092 185.9546 23.4596 2.6975 266.5976 62.1881 21.4642 0.7291 7.9956 132.6319 88.5589 12.4227 86.9637 112.5777 69.6381 37.1197 26.2344 10.9737 50.5522 18.4960 36.4080 15.1944 5.5583 67.4885 35.6452 5.8128 9.0025 7.5883 9.6959 11.8620 1.0211 23.1538 14.8212 5.8901 60.3394 2.8986 16.7916 1.8567 2.6241 4.1263 3.2264 56.5346 20.3609 8.4616 13.0036 0.3954 36.0440 2.4063 38.5299 9.5718 10.3702 79.5569 207.6288 14.2064 19.8883 16.2594 13.8168 16.3078 42.1171 19.1470 18.9126 14.6599 2.5486 15.8078 24.0929 6.2051 27.4643 0.8826 10.8530 7.6508 9.1060 25.0151 32.0924 57.6518 48.1450
temp: 298.150 k
press: 1.00000 atm
elementType: 17 17 16 15 8 8 8 8 7 7 7 6 6 6 6 6 6 6 6 6 6 6 1 1 1 1 1 1 1 1 1 1 1 1 1 1 1 1 1 1 1 1 1 1
symmnumber: 1
zpe: 901802.1 jmol-1
zpe.correction: 0.343478 hartree
zpe.thermalcorrener: 0.369519 hartree
zpe.thermalcorrenthalpy: 0.370464 hartree
zpe.thermalcorrgfe: 0.283368 hartree
zpe.sumelectzpe: -2555.161502 hartree
zpe.sumelectthermal: -2555.135461 hartree
zpe.sumelectthermalent: -2555.134517 hartree
zpe.sumelectthermalfe: -2555.221612 hartree
dipole: 2.4726 -2.1707 -2.4609
dipole: 4.1087
quadrupole: -140.9695 -164.7216 -170.9074
quadrupole: 12.1368 -19.0965 -2.7398
quadrupole: 17.8967 -5.8554 -12.0412 12.1368 -19.0965 -2.7398
hfenergy: -2555.5049806 hartree
pointgroup: C01 [X(C11H22Cl2N3O4P1S1)]
dipole: 1.0130186 0.9037472 0.8775328 debye
polarizability: 260.239933|-5.2853223|202.5408002|-12.7737931|-5.922616|177.14623 unknown
InChI: InChI=1S/C11H22Cl2N3O4PS/c12-3-5-16(6-4-13)21(14,19)20-7-1-10-15-9(11(17)18)2-8-22-10/h9-10,15,17H,1-8,14H2
charge 0 multiplicity 1
44 atoms
Cl -6.728533 0.225178 2.106081
Cl -2.073132 -3.992812 -0.855134
S  1.610613 -1.203196 1.080002
P  -2.460121 1.314198 -0.847481
O  -1.572362 2.023666 0.485104
O  -1.628728 0.900809 -2.14723
O  6.832054 0.501086 -0.09425
O  5.358517 0.839642 -1.86121
N  3.209251 0.867009 -0.089575
N  -3.304516 -0.078877 -0.222105
N  -3.58252 2.618021 -0.915326
C  2.056151 0.704958 0.745558
C  4.478142 0.292223 0.382408
C  4.434185 -1.254678 0.638207
C  0.8184 1.38418 0.141715
C  3.359041 -1.6305 1.674006
C  -0.423378 1.273649 1.044475
C  5.554385 0.590638 -0.652739
C  -4.174595 0.034477 0.968215
C  -3.127301 -1.403197 -0.861199
C  -5.644856 0.21156 0.554728
C  -2.059628 -2.242668 -0.138025
H  2.277565 1.078579 1.762692
H  4.766212 0.781999 1.333243
H  4.231106 -1.780727 -0.313331
H  5.427686 -1.57509 1.00714
H  0.593979 0.949717 -0.851289
H  1.058086 2.45295 -0.012665
H  3.054393 0.742109 -1.097917
H  3.530868 -1.112164 2.635855
H  3.350465 -2.716759 1.85954
H  -0.709338 0.217087 1.213883
H  -0.250945 1.747859 2.025958
H  -4.067071 -0.87258 1.591877
H  -3.85729 0.894953 1.583303
H  -4.093385 -1.941661 -0.849304
H  -2.828054 -1.25695 -1.912946
H  -3.331512 3.484884 -0.438974
H  -4.216456 2.691894 -1.709836
H  -6.016742 -0.622328 -0.059043
H  -5.809524 1.178049 0.059152
H  -2.266736 -2.364156 0.936294
H  -1.039967 -1.863211 -0.299582
H  7.516892 0.652382 -0.801074
