program: Gaussian 09
title: 000163539
version: EM64L-G09RevD.01
frameworkgroup: C1[X(C18H13NO4)]
method: RPBEPBE
basis: SDD
operation: Freq
keyword: #p
keyword: freq=noraman
keyword: PBEPBE/SDD
title: #p freq=noraman PBEPBE/SDD
converged: YES YES NO NO
title: Mulliken charges:
elementType: O O O O N C C C C C C C C C C C C C C C C C C H H H H H H H H H H H H H
charge: -0.413285 -0.418565 -0.177527 -0.197392 -0.005006 0.206225 -0.351297 0.526105 -0.212040 0.052081 0.315618 0.280571 -0.770680 0.143262 -0.403792 -0.203725 0.426710 -0.409429 -0.498615 -0.332670 -0.432158 -0.257799 -0.246406 0.294527 0.233899 0.234377 0.243040 0.237465 0.269736 0.241751 0.221900 0.343333 0.246582 0.346161 0.232358 0.234682
chargesum: 0.00000
title: Mulliken charges with hydrogens summed into heavy atoms:
elementType: O O O O N C C C C C C C C C C C C C C C C C C
charge: -0.069952 -0.072404 -0.177527 -0.197392 -0.005006 0.206225 -0.056770 0.526105 0.021859 0.052081 0.315618 0.280571 -0.536303 0.143262 -0.160751 0.033740 0.426710 -0.139693 -0.256864 -0.110770 -0.185576 -0.025441 -0.011724
polarizability: 3.88583320e+02 -4.56155719e+00 2.37229983e+02 -1.42196405e+00 -7.28735530e+00 1.09831443e+02
1716.lowfreq: -4.8553 -0.0001 0.0004 0.0005 4.3864 8.6494 41.1588 44.4168 52.2634
frequency: 41.0451 44.3912 52.2578 80.1856 88.3047 136.4368 146.2656 162.1950 167.9871 195.8928 232.5677 239.5101 277.4955 290.9910 311.8629 337.0837 337.8989 372.0281 375.0423 384.4990 425.8600 448.2228 466.2843 493.3840 520.0446 532.7712 541.7491 560.7760 586.2064 604.8698 621.5015 640.8857 685.7831 696.4541 719.1911 752.7449 754.0701 766.0275 787.0892 800.4859 808.3580 844.0492 851.5611 873.7432 887.3786 888.6328 925.1348 927.7346 935.2326 959.0025 972.5331 981.3460 982.3775 986.3016 996.0539 1038.7170 1063.2146 1110.9520 1161.7229 1169.1581 1181.5700 1182.4431 1201.6173 1202.8219 1219.1433 1238.6789 1239.6617 1257.7925 1265.1150 1283.3911 1303.4866 1316.5896 1344.5350 1352.8465 1369.6596 1390.9066 1396.6077 1412.0763 1420.7619 1435.0865 1445.8337 1459.8868 1499.3325 1513.3577 1566.0102 1604.5752 1615.8505 1627.1874 1646.9337 2976.0110 3098.7311 3121.4581 3127.3886 3134.6920 3136.5530 3147.3740 3156.1772 3164.9904 3168.6882 3182.5224 3525.1803 3534.8261
redmass: 5.8025 5.3260 6.3198 6.6502 7.3700 4.9051 5.6369 5.8990 7.0116 5.2683 5.4727 5.2156 5.5374 1.1861 3.8595 4.2362 1.3378 5.2807 4.6583 4.4407 3.3749 5.0295 5.8335 4.4143 5.5520 5.0989 3.7822 3.8866 4.7923 6.2006 5.6247 6.1091 4.8282 5.9063 6.8770 2.3098 3.1748 1.6069 3.5976 2.7991 2.0521 2.0713 6.0885 4.2668 1.8375 3.6452 2.4403 3.8877 3.5563 1.3685 4.4459 3.6287 1.4392 1.4899 1.3658 2.3572 2.5629 2.2675 1.5731 1.2163 1.1403 1.3929 1.2646 1.4635 5.7120 2.0740 1.8347 1.6572 2.0903 1.7055 2.1559 1.3941 2.4289 1.4746 2.9017 2.5967 3.7939 3.2973 1.8919 2.5914 3.4423 3.5442 4.0352 3.7050 7.3554 6.3680 6.7891 6.5969 7.0302 1.0841 1.0862 1.0882 1.0864 1.0898 1.0888 1.0929 1.0918 1.0976 1.0997 1.0948 1.0661 1.0661
irintensity: 0.1269 0.9827 0.4584 0.5003 0.9647 0.0666 3.0240 1.4655 3.1633 0.5763 1.4660 5.3085 1.1747 181.7350 11.1865 6.6051 93.4389 4.2659 39.4309 33.1231 5.0768 1.8972 4.1178 12.9710 7.2334 1.0493 1.7029 5.8630 3.3895 1.0900 6.3742 7.3725 6.6870 9.8549 35.1665 19.6451 9.3941 28.5524 3.5956 30.5331 0.2169 42.6163 14.2809 4.2863 3.9193 2.7844 42.0169 37.3767 41.3060 1.3828 91.4461 0.7208 3.3689 0.7398 0.5426 9.9794 4.0819 2.2361 14.8739 3.4865 10.9440 52.2736 15.5860 63.7507 156.0151 13.6711 5.0663 30.5450 2.2271 9.2852 7.3256 7.9288 28.8214 44.0391 50.4824 33.3222 32.4365 5.7040 5.9385 3.6357 1.1280 5.5316 9.4538 13.9336 0.9127 11.7686 1.1369 0.5035 2.6926 46.8220 7.1124 6.9896 1.5537 3.3539 10.9602 4.5597 26.6028 17.9281 34.2575 5.7156 11.8216 5.8967
temp: 298.150 k
press: 1.00000 atm
elementType: 8 8 8 8 7 6 6 6 6 6 6 6 6 6 6 6 6 6 6 6 6 6 6 1 1 1 1 1 1 1 1 1 1 1 1 1
symmnumber: 1
zpe: 702865.3 jmol-1
zpe.correction: 0.267707 hartree
zpe.thermalcorrener: 0.286130 hartree
zpe.thermalcorrenthalpy: 0.287074 hartree
zpe.thermalcorrgfe: 0.221186 hartree
zpe.sumelectzpe: -1047.682884 hartree
zpe.sumelectthermal: -1047.664462 hartree
zpe.sumelectthermalent: -1047.663518 hartree
zpe.sumelectthermalfe: -1047.729406 hartree
dipole: -3.0982 -4.3771 0.4032
dipole: 5.3778
quadrupole: -111.0726 -129.4396 -141.6896
quadrupole: -8.0294 1.0214 -10.0805
quadrupole: 16.3280 -2.0390 -14.2890 -8.0294 1.0214 -10.0805
hfenergy: -1047.9505917 hartree
pointgroup: C01 [X(C18H13N1O4)]
dipole: 1.2102109 -1.7242417 -0.197202 debye
polarizability: 388.6199838|3.8646153|236.8196772|-1.7035789|9.9997772|110.2050854 unknown
InChI: InChI=1S/C18H13NO4/c20-15-8-6-11-9-14-12-4-2-1-3-10(12)5-7-13(14)17(19(22)23)16(11)18(15)21/h1-9,15,18,20-21H
charge 0 multiplicity 1
36 atoms
O  -3.6046 0.252192 -1.752433
O  -4.18515 -1.048766 1.745568
O  -1.073867 3.339181 -0.710172
O  -2.417108 2.645516 0.993127
N  -1.50569 2.434293 0.100422
C  -1.797232 -0.019126 -0.111245
C  -3.303178 0.105565 -0.304422
C  -1.220538 -1.331649 -0.205367
C  -4.096234 -1.095867 0.268968
C  -0.921909 1.068255 0.010836
C  1.067449 -0.38754 -0.061064
C  0.510672 0.94228 0.044623
C  0.175174 -1.488605 -0.189208
C  2.522074 -0.568633 -0.020318
C  -2.106818 -2.504755 -0.287213
C  -3.449665 -2.421707 -0.066336
C  3.36701 0.587499 0.144111
C  1.396285 2.071668 0.211324
C  2.765368 1.893037 0.264842
C  3.151016 -1.846863 -0.135079
C  4.786904 0.432981 0.189183
C  4.545591 -1.978663 -0.089929
C  5.374304 -0.8315 0.07416
H  -3.691088 1.036293 0.133799
H  -5.109779 -1.036732 -0.181694
H  0.573327 -2.505532 -0.257709
H  -1.637506 -3.47675 -0.483097
H  -4.080393 -3.316086 -0.061218
H  0.980374 3.078505 0.283189
H  3.423805 2.759676 0.394326
H  2.547298 -2.750044 -0.263695
H  -3.251323 -0.544312 -2.230108
H  5.410935 1.32537 0.314891
H  -4.693962 -0.237058 2.006927
H  5.001411 -2.97036 -0.181925
H  6.463144 -0.942962 0.108935
