program: Gaussian 09
title: 000163524
version: EM64L-G09RevD.01
frameworkgroup: C1[X(C22H16O3)]
method: RPBEPBE
basis: SDD
operation: Freq
keyword: #pfreq=noraman
keyword: PBEPBE/SDD
title: #p freq=noraman PBEPBE/SDD
converged: NO YES NO NO
title: Mulliken charges:
elementType: O O O C C C C C C C C C C C C C C C C C C C C C C H H H H H H H H H H H H H H H H
charge: -0.306864 -0.445058 -0.435234 -0.167847 -0.236502 -0.178620 0.187350 -0.356505 0.422859 0.192134 -0.447353 0.503842 -0.505678 -0.666467 -0.678783 0.496650 0.249112 0.194413 -0.508142 0.416683 -0.472855 -0.364879 -0.433095 -0.259035 -0.248878 0.235083 0.243348 0.231618 0.244656 0.238278 0.370966 0.245779 0.256021 0.342490 0.234588 0.244946 0.235969 0.224357 0.240795 0.229044 0.230813
chargesum: 0.00000
title: Mulliken charges with hydrogens summed into heavy atoms:
elementType: O O O C C C C C C C C C C C C C C C C C C C C C C
charge: -0.306864 -0.074092 -0.092744 0.067236 0.006847 0.052998 0.187350 -0.111849 0.422859 0.192134 -0.209075 0.503842 -0.259899 -0.410446 -0.444195 0.496650 0.249112 0.194413 -0.263196 0.416683 -0.236886 -0.140522 -0.192301 -0.029991 -0.018065
polarizability: 4.83920297e+02 -1.45083556e+01 2.50145094e+02 9.26628345e+00 1.19515663e+01 1.17973063e+02
1716.lowfreq: -3.8087 -0.0004 0.0003 0.0006 3.4655 8.9549 32.7739 42.4691 63.8599
frequency: 32.7512 42.4441 63.8595 84.8476 105.9586 124.3295 153.1837 170.2419 186.9472 193.5490 251.2864 256.5567 265.6682 292.7495 319.6587 337.9763 376.3993 388.3527 407.7059 429.3098 438.4863 457.7308 477.3148 491.1546 493.8599 505.5697 530.4089 538.3017 551.3298 566.6664 588.2665 628.2673 632.6438 643.1278 674.9213 710.0211 716.1979 729.6324 740.7819 758.4670 759.5292 802.3658 814.7728 826.8162 830.2883 833.4477 836.5410 858.5040 871.3210 887.5608 910.9398 916.9729 929.8297 950.4191 958.1455 979.7554 984.8276 986.9791 993.6802 1003.7316 1009.0712 1041.7225 1066.6761 1079.8511 1100.1978 1111.4488 1156.9004 1166.0849 1178.7114 1195.8515 1209.9516 1216.2841 1217.6866 1226.6648 1233.3978 1237.7180 1258.0678 1284.7548 1291.2899 1298.2415 1304.2718 1316.4027 1348.8601 1368.3953 1381.0730 1391.8310 1405.2704 1410.7873 1418.2834 1432.0323 1442.4302 1455.7132 1462.5083 1480.6060 1508.6767 1559.5413 1570.5557 1598.1139 1616.2258 1627.8949 1633.4134 2994.9157 3015.5808 3116.6442 3119.7762 3123.0893 3123.7208 3132.0939 3135.1514 3138.4739 3139.3759 3145.0737 3147.8417 3151.2467 3165.9771 3417.7866 3541.2290
redmass: 6.2661 5.2930 6.3970 4.5014 6.2511 5.4842 4.9995 6.1673 5.0028 5.3029 1.1677 4.3027 4.3251 6.2063 5.4804 5.5031 5.1176 4.8791 3.8098 3.2119 4.4855 4.5667 4.7258 4.4875 2.1718 1.9319 3.2757 5.8549 3.5739 4.0047 5.9355 6.1765 5.6086 4.8985 5.0379 5.1202 4.3029 4.9841 3.5948 1.9992 2.2130 1.8687 2.7362 3.7276 2.1803 1.7457 2.9262 4.5485 4.2834 1.6775 1.6385 4.2277 2.0710 6.2530 1.4038 1.5549 1.4353 2.2216 1.3837 3.8310 2.6556 2.1462 1.6608 1.5380 1.9897 1.8922 1.3655 1.3938 1.0803 1.7238 1.4124 1.5215 1.3589 1.5150 1.5672 1.5817 1.7526 1.6169 1.5012 1.9888 1.3115 2.1745 1.9477 2.6498 1.5247 3.6878 2.2578 2.9160 2.5677 3.0550 5.2360 3.9265 2.8191 3.4789 3.7090 5.6320 7.9971 5.9921 6.3641 6.8098 6.9970 1.0851 1.0869 1.0884 1.0861 1.0864 1.0868 1.0894 1.0904 1.0916 1.0935 1.0982 1.0976 1.0929 1.0999 1.0650 1.0662
irintensity: 0.5879 0.3158 1.8352 0.1239 0.2938 1.8386 0.4187 2.3422 2.9524 5.9991 123.1048 19.0119 1.5439 8.0348 6.2488 2.2851 3.7605 2.5085 1.3850 12.9043 0.2804 15.8750 1.2283 8.7244 38.4052 48.8367 4.2466 5.7311 4.6792 14.3244 19.0715 42.2008 31.7739 21.6125 0.8581 3.0783 1.4803 5.6059 4.1809 23.0540 30.6148 1.7404 20.2720 77.1788 14.1578 5.7530 12.6768 1.6989 3.3266 0.3121 99.0606 14.1733 0.8351 53.3561 7.0021 2.4988 3.8553 28.5066 0.0163 49.7199 1.9096 8.9692 15.4912 10.1117 9.1864 2.3282 1.3170 24.8248 0.8292 5.9946 18.8433 9.8125 16.1001 7.2231 22.3428 16.6207 5.5168 2.8257 3.2345 4.4718 1.3114 5.4713 7.7193 15.0924 83.8625 3.9187 2.6975 2.5642 0.5642 3.7340 8.8928 0.6343 27.0547 1.8538 12.7345 5.7557 2.5024 0.0291 1.6041 1.1059 1.7664 29.1553 74.8979 5.4248 0.0892 3.9519 1.0861 9.6848 0.3291 16.2405 27.1408 37.3490 13.6812 36.4726 40.2969 30.5829 5.8160
temp: 298.150 k
press: 1.00000 atm
elementType: 8 8 8 6 6 6 6 6 6 6 6 6 6 6 6 6 6 6 6 6 6 6 6 6 6 1 1 1 1 1 1 1 1 1 1 1 1 1 1 1 1
symmnumber: 1
zpe: 832689.3 jmol-1
zpe.correction: 0.317155 hartree
zpe.thermalcorrener: 0.336043 hartree
zpe.thermalcorrenthalpy: 0.336987 hartree
zpe.thermalcorrgfe: 0.270377 hartree
zpe.sumelectzpe: -1071.887103 hartree
zpe.sumelectthermal: -1071.868215 hartree
zpe.sumelectthermalent: -1071.867271 hartree
zpe.sumelectthermalfe: -1071.933881 hartree
dipole: 0.9156 0.9885 -1.8116
dipole: 2.2577
quadrupole: -118.7008 -128.4197 -156.9562
quadrupole: -4.3404 12.7193 7.3251
quadrupole: 15.9914 6.2726 -22.2640 -4.3404 12.7193 7.3251
hfenergy: -1072.204258 hartree
pointgroup: C01 [X(C22H16O3)]
dipole: -0.3615315 0.3870768 0.7130811 debye
polarizability: 483.9287857|13.9231433|250.1633751|10.4534559|-11.425597|117.9462926 unknown
InChI: InChI=1S/C22H16O3/c23-19-15-8-7-13-9-16-12(6-5-11-3-1-2-4-14(11)16)10-17(13)18(15)21-22(25-21)20(19)24/h1-10,19-24H
charge 0 multiplicity 1
41 atoms
O  3.466808 -2.250674 -0.703194
O  5.074481 -0.402583 -1.824843
O  4.95988 1.100188 1.618496
C  4.431359 -1.582007 0.257021
C  2.972757 -1.428317 0.525264
C  5.175718 -0.386397 -0.366225
C  2.30372 -0.130229 0.243275
C  4.605748 0.946125 0.182551
C  3.091358 1.022701 0.098584
C  0.861883 -0.050156 0.16159
C  2.464151 2.295097 -0.101788
C  0.240068 1.249725 -0.029054
C  1.079159 2.409651 -0.1546
C  0.015896 -1.187062 0.247048
C  -1.176343 1.349489 -0.098326
C  -1.390318 -1.080742 0.17336
C  -2.017377 0.223039 0.004159
C  -3.485849 0.307349 -0.062086
C  -2.221926 -2.265444 0.262118
C  -4.263874 -0.901799 0.034908
C  -3.595369 -2.179664 0.195665
C  -4.183121 1.54179 -0.218628
C  -5.6880 -0.835753 -0.028138
C  -5.58503 1.58831 -0.278452
C  -6.347355 0.391478 -0.182854
H  5.016442 -2.286323 0.856844
H  2.512449 -2.083446 1.273478
H  6.251614 -0.447912 -0.118016
H  5.048247 1.768322 -0.415511
H  3.097396 3.183529 -0.203073
H  4.301822 -0.997318 -2.045403
H  0.608596 3.388795 -0.30095
H  0.453966 -2.186088 0.349962
H  5.921465 1.336123 1.684363
H  -1.603302 2.3479 -0.24105
H  -1.728977 -3.237073 0.383402
H  -4.213763 -3.082469 0.263886
H  -3.62559 2.480446 -0.294114
H  -6.263018 -1.766452 0.047034
H  -6.09347 2.551104 -0.399067
H  -7.440897 0.431445 -0.229837
