program: Gaussian 09
title: 000163499
version: EM64L-G09RevD.01
frameworkgroup: C1[X(C8H12N2O)]
method: RPBEPBE
basis: SDD
operation: Freq
keyword: #p
keyword: freq=noraman
keyword: PBEPBE/SDD
title: #p freq=noraman PBEPBE/SDD
converged: NO YES NO NO
title: Mulliken charges:
elementType: O N N C C C C C C C C H H H H H H H H H H H H
charge: -0.415501 -0.024136 0.007860 0.241144 -0.714071 -0.714077 -0.701740 -0.023932 -0.368001 -0.426452 0.294275 0.213316 0.210766 0.243877 0.243888 0.210760 0.213312 0.197755 0.220656 0.220648 0.263905 0.242405 0.363345
chargesum: 0.00000
title: Mulliken charges with hydrogens summed into heavy atoms:
elementType: O N N C C C C C C C C
charge: -0.052157 -0.024136 0.007860 0.241144 -0.046111 -0.046118 -0.062681 -0.023932 -0.104096 -0.184048 0.294275
polarizability: 1.40242526e+02 2.87795071e+00 9.92392894e+01 -6.66754433e-05 -8.02658511e-05 6.71512593e+01
1716.lowfreq: -8.2530 -7.8743 -0.0009 -0.0006 0.0001 4.5226 36.2634 78.6036 181.8217
frequency: 36.1595 78.5799 181.8176 199.9732 223.6210 265.2101 270.4347 293.6251 312.0223 346.6625 366.5350 366.7805 414.3426 429.7550 479.2722 505.6740 535.1620 627.9064 654.5038 794.1770 810.4779 842.3363 893.2987 924.6086 926.2207 935.3073 947.4625 996.8867 1020.7439 1022.8847 1120.2945 1159.4544 1185.5374 1205.4233 1246.1132 1248.9782 1265.9121 1311.3666 1364.2454 1366.6325 1373.8243 1396.5740 1427.5393 1451.3141 1463.3997 1469.1215 1473.9311 1476.6061 1500.1990 1520.7367 1562.0316 2975.5380 2977.5954 2986.4108 3069.2275 3072.9442 3082.8459 3089.7383 3089.8582 3095.5459 3096.1328 3146.3389 3560.2679
redmass: 3.7064 4.8499 3.3811 1.1759 1.9338 1.0617 1.1314 3.0987 2.7622 2.4938 3.4297 1.1216 4.1555 5.1876 3.5718 3.2884 2.4373 9.6680 4.9633 7.9780 7.4976 2.7422 1.5929 1.4262 1.7359 1.5913 1.2048 3.9751 1.4337 1.4082 1.8221 2.4604 2.4280 2.9008 4.4025 3.7597 1.9026 2.9854 1.1853 1.5474 1.3535 1.2909 2.8006 1.0505 1.0492 1.0469 1.0520 1.0570 1.1012 6.3427 5.0992 1.0344 1.0350 1.0360 1.1005 1.0997 1.0990 1.0919 1.1008 1.0997 1.0992 1.0932 1.0662
irintensity: 1.8357 1.1785 2.8398 0.0073 0.0344 0.0015 0.0019 0.0900 4.8787 1.0758 12.9520 156.1812 3.4045 1.1071 5.3035 2.8943 5.7221 4.0022 7.3092 8.2223 2.7631 7.4643 19.6865 5.3978 2.3044 3.7288 0.0888 0.3704 0.0397 0.7506 147.1781 104.5058 71.6412 6.3697 10.2205 1.9514 47.9731 13.6532 19.7968 29.9399 27.1770 0.7201 137.9796 0.0359 0.9007 0.7526 12.3615 15.1367 51.5506 25.6905 10.6626 39.7265 20.0066 38.8787 15.7881 23.2274 82.7834 24.5547 0.6126 44.0668 36.2555 14.5243 38.6580
temp: 298.150 k
press: 1.00000 atm
elementType: 8 7 7 6 6 6 6 6 6 6 6 1 1 1 1 1 1 1 1 1 1 1 1
symmnumber: 1
zpe: 493663.7 jmol-1
zpe.correction: 0.188027 hartree
zpe.thermalcorrener: 0.199280 hartree
zpe.thermalcorrenthalpy: 0.200225 hartree
zpe.thermalcorrgfe: 0.151407 hartree
zpe.sumelectzpe: -495.921697 hartree
zpe.sumelectthermal: -495.910443 hartree
zpe.sumelectthermalent: -495.909499 hartree
zpe.sumelectthermalfe: -495.958317 hartree
dipole: 2.0067 1.4112 0.0001
dipole: 2.4532
quadrupole: -56.4916 -67.9266 -67.5273
quadrupole: 7.8719 -0.0002 0.0000
quadrupole: 7.4902 -3.9448 -3.5455 7.8719 -0.0002 0.0000
hfenergy: -496.1097236 hartree
pointgroup: C01 [X(C8H12N2O1)]
dipole: 0.7851206 0.5613595 -0.0002309 debye
dipolederiv: -1.5607547 -0.009782 0.0000396 0.0034428 -0.0243038 -0.0001763 0.000028 -0.0001762 -0.4259668 -0.5717612 -0.0925019 0.0000562 0.1993916 -0.2756332 0.0000101 -0.0000764 0.0000252 -0.212314 -0.5533704 0.1060897 -0.0000329 -0.1982171 -0.2854904 0.0000623 0.0000981 0.0000504 -0.1808662 0.0267651 -0.0592589 0.0000534 -0.1913747 0.0976408 0.0000038 0.0002042 0.000004 0.0945857 -0.0535847 -0.0050086 0.0302297 0.0637556 -0.0083872 0.0487826 -0.0631232 0.0461116 -0.0027172 -0.0535455 -0.0050398 -0.0302257 0.0638332 -0.0085278 -0.0487841 0.0630092 -0.0461137 -0.002589 0.0455183 0.0309754 -0.000017 0.0311327 -0.0679421 0.0000468 -0.0000333 0.0000473 0.0240851 0.9954233 0.0528946 -0.0001037 0.0851208 0.018572 -0.000017 -0.000133 -0.0000207 -0.0069191 0.0633553 0.138412 -0.0000663 -0.3353408 0.3833828 -0.0001784 0.0001445 -0.0001959 -0.0511452 -0.0031569 -0.1206857 0.0000496 0.4052327 0.3392951 -0.0001991 -0.0001837 -0.000182 -0.0772195 1.3856291 0.0259763 -0.0000456 -0.0059419 -0.3236746 0.0002251 -0.0000247 0.000224 0.1836253 0.0860911 -0.0420869 -0.0644207 -0.0286929 0.0224953 -0.122428 -0.0373619 -0.0686966 -0.1160518 -0.2208287 -0.0391647 0.0288036 -0.0311872 0.0952227 0.0153605 0.0122696 0.0107361 0.0712722 0.1044396 0.0925995 -0.0151379 0.0719564 -0.0951124 0.0370183 -0.0172745 -0.0078196 0.0827087 0.1044718 0.0926188 0.0150355 0.0719723 -0.0951293 -0.0368023 0.0171896 0.0080235 0.0827468 -0.2208317 -0.0392105 -0.0287118 -0.0311955 0.0951919 -0.0153833 -0.012162 -0.0107529 0.0713084 0.086108 -0.0419957 0.0644389 -0.028631 0.0227278 0.1222643 0.0373464 0.0685422 -0.1163158 -0.2289945 0.0248972 -0.0000077 -0.0447613 0.079777 0.0000118 0.0000337 0.0000096 0.0943096 0.0964487 -0.0437115 -0.0657768 -0.015229 0.0080976 -0.0859477 -0.0498717 -0.1133348 -0.0773562 0.0964417 -0.0436274 0.0658236 -0.0151616 0.0083276 0.0858531 0.0498851 0.1132401 -0.0776107 0.027778 0.0743228 -0.0000303 0.0982665 -0.0075162 0.0000541 -0.0000428 0.0000541 0.1218318 -0.0502307 -0.1164426 0.0000561 -0.130961 -0.034956 0.0000765 0.0000624 0.0000776 0.1296077 0.398589 0.0197298 -0.0000098 -0.0374106 0.0559426 0.0001469 0.0000164 0.0001466 0.3909904 unknown
polarizability: 140.1951038|3.197624|99.2867051|-0.0039024|-0.0142762|67.1512657 unknown
InChI: InChI=1S/C8H12N2O/c1-8(2,3)7-9-4-6(11)5-10-7/h4-5,11H,1-3H3
charge 0 multiplicity 1
23 atoms
O  3.724791 -0.06285 -0.000011
N  0.223423 -1.169013 0.000556
N  0.234334 1.253192 -0.000509
C  -1.953283 0.018024 0.00012
C  -2.425763 -0.750747 1.27003
C  -2.425942 -0.752316 -1.268754
C  -2.543304 1.447305 -0.00071
C  -0.419241 0.048913 0.000045
C  1.579444 -1.176858 0.000527
C  1.597089 1.234129 -0.000532
C  2.330894 0.025358 -0.000017
H  -2.12497 -0.21732 2.19082
H  -3.52814 -0.836147 1.267985
H  -1.990115 -1.764173 1.29323
H  -1.990254 -1.765749 -1.290778
H  -3.528316 -0.837749 -1.266417
H  -2.125329 -0.22002 -2.190257
H  -3.647822 1.387763 -0.000656
H  -2.219128 2.016056 0.887726
H  -2.219167 2.014998 -0.88984
H  2.086466 -2.147664 0.000939
H  2.103886 2.210161 -0.000981
H  4.144347 0.834407 -0.000414
