program: Gaussian 09
title: 000163400
version: EM64L-G09RevD.01
frameworkgroup: C1[X(C14H28O2)]
method: RPBEPBE
basis: SDD
operation: Freq
keyword: #pfreq=noraman
keyword: PBEPBE/SDD
title: #p freq=noraman PBEPBE/SDD
converged: YES YES NO NO
title: Mulliken charges:
elementType: O O C C C C C C C C C C C C C C H H H H H H H H H H H H H H H H H H H H H H H H H H H H
charge: -0.289260 -0.267942 0.283691 -0.442804 -0.406717 -0.376241 -0.025511 -0.770328 -0.040869 -0.716316 -0.717002 0.094522 -0.697081 -0.645949 -0.225444 -0.679897 0.205343 0.207909 0.193214 0.246607 0.190109 0.183105 0.190642 0.235371 0.212298 0.220197 0.256495 0.206302 0.230338 0.202637 0.210932 0.205546 0.210732 0.166441 0.219006 0.205349 0.242882 0.212047 0.225738 0.200258 0.187597 0.201415 0.224711 0.229926
chargesum: 0.00000
title: Mulliken charges with hydrogens summed into heavy atoms:
elementType: O O C C C C C C C C C C C C C C
charge: -0.289260 -0.267942 0.283691 -0.029553 0.033103 -0.003027 0.165131 -0.102462 0.215627 -0.077040 -0.089792 0.260963 -0.029844 -0.208164 0.162411 -0.023845
polarizability: 1.75458689e+02 1.04549055e+00 1.58004647e+02 7.70070514e+00 -3.28165729e+00 1.53206217e+02
1716.lowfreq: -12.0215 -9.5353 -6.4007 -0.0009 -0.0006 0.0005 15.1186 20.4528 33.0179
frequency: 13.5361 20.1634 32.9577 40.9479 69.1119 75.0544 92.9453 101.8129 114.6756 127.0352 179.9706 194.9825 207.2245 211.9776 219.4711 230.1010 236.0065 240.4197 243.5747 261.1924 301.9292 313.1975 327.4528 372.2770 374.2094 412.0780 425.4358 444.2003 479.2621 507.6989 523.7238 560.1422 700.7411 710.8185 737.6991 788.5512 796.0693 812.9230 817.1234 856.5634 909.8581 913.8899 919.2419 920.5635 940.3691 943.0065 952.1592 973.7212 998.5761 1017.9208 1037.9202 1041.7365 1050.9020 1063.6736 1072.2413 1089.7106 1108.4907 1128.4508 1133.8606 1140.5787 1148.3431 1176.4586 1187.4637 1197.6150 1218.7673 1256.4248 1258.6809 1281.1032 1301.9281 1305.3461 1307.2504 1315.1386 1331.3413 1339.4948 1341.4536 1358.2105 1375.1760 1376.2425 1380.0788 1386.4980 1392.0820 1393.6689 1423.4487 1441.3153 1456.2095 1456.9596 1458.0991 1464.3601 1467.8520 1468.4728 1472.1287 1477.5662 1478.6884 1479.5650 1482.1388 1487.8404 1490.8869 1646.5793 2911.7774 2925.2095 2942.9476 2950.2930 2963.4882 2969.5597 2970.2094 2970.9931 2976.5520 2986.2886 2991.9475 2995.4839 2999.0998 3027.5351 3055.3279 3060.3574 3064.5677 3065.5857 3076.5289 3078.1424 3089.0459 3092.1939 3092.3946 3093.5836 3098.9430 3109.5679 3142.0771 3194.4788
redmass: 2.8300 3.0847 3.2264 3.0713 2.7788 2.3093 2.6881 2.9668 1.7804 3.0272 2.9907 1.9808 1.0914 1.9388 1.2320 1.1758 2.0436 1.2538 1.3443 2.6728 2.4725 2.7193 2.4792 2.5677 2.3474 3.1943 2.1820 2.5159 2.8434 2.6040 3.8995 2.7694 1.9562 3.0667 1.2720 2.2489 1.9906 2.4199 1.1129 1.5873 3.0968 1.1872 2.1684 2.1623 1.3336 1.6290 1.4242 1.7062 1.4785 1.2258 2.9945 2.8206 2.1048 1.7144 2.3541 1.9869 2.3490 2.1410 1.6196 1.9925 2.1739 1.7758 2.6746 1.9602 1.7341 1.1478 1.4274 1.2413 1.1254 1.3061 1.3834 1.2543 1.4166 1.2380 1.5334 1.5409 1.2290 1.2289 1.2384 1.2588 1.2155 1.2969 1.1894 1.0802 1.0705 1.0423 1.0444 1.0492 1.0453 1.0528 1.0577 1.0579 1.0604 1.0852 1.0567 1.0521 1.0766 4.5690 1.0776 1.0607 1.0612 1.0805 1.0355 1.0384 1.0589 1.1063 1.0642 1.0364 1.0357 1.0356 1.0972 1.0986 1.0994 1.1004 1.0998 1.0990 1.0984 1.0986 1.0990 1.0937 1.0694 1.0960 1.1008 1.1001 1.0924 1.1128
irintensity: 0.1450 0.2511 0.3961 0.2165 0.0548 0.7151 2.8887 0.2916 0.5289 3.3906 0.5796 1.6162 0.0704 0.6771 0.2442 0.0569 0.1460 0.7618 0.6377 0.1133 3.7933 0.4483 2.7307 1.0738 1.0558 5.9170 0.5024 1.4058 2.6738 2.5582 10.2095 4.5481 5.0607 4.2044 6.1540 17.5826 20.4891 2.0999 2.7766 8.9678 120.3319 3.8330 31.6241 45.3894 77.8555 3.7028 2.1232 22.6360 5.6039 32.3341 85.4920 2.3163 74.6584 33.9790 2.0065 66.3973 23.6429 2.7180 4.5638 4.2687 12.4482 11.8786 14.7930 4.9803 23.2594 0.7548 3.2498 1.7629 2.9271 2.8639 9.5721 28.9079 2.8038 24.0914 4.2119 1.3926 27.9400 11.0546 19.1867 32.0111 16.2564 17.6814 19.7061 3.2092 0.6249 11.5529 7.0194 2.8999 3.6675 4.9996 4.8529 3.4357 1.5357 7.5451 6.0863 23.6447 7.6087 9.5448 13.6400 96.3995 18.8932 25.1459 43.1819 27.2365 6.1278 53.8325 49.0933 27.5387 26.2396 21.8066 35.3017 7.7998 6.6795 8.6480 106.5561 78.3973 44.0969 46.7311 37.5549 13.2799 10.2021 40.6642 38.1340 21.0844 3.0260 22.9069
temp: 298.150 k
press: 1.00000 atm
elementType: 8 8 6 6 6 6 6 6 6 6 6 6 6 6 6 6 1 1 1 1 1 1 1 1 1 1 1 1 1 1 1 1 1 1 1 1 1 1 1 1 1 1 1 1
symmnumber: 1
zpe: 1027037.0 jmol-1
zpe.correction: 0.391178 hartree
zpe.thermalcorrener: 0.412605 hartree
zpe.thermalcorrenthalpy: 0.413550 hartree
zpe.thermalcorrgfe: 0.338833 hartree
zpe.sumelectzpe: -699.358101 hartree
zpe.sumelectthermal: -699.336674 hartree
zpe.sumelectthermalent: -699.335729 hartree
zpe.sumelectthermalfe: -699.410447 hartree
dipole: -2.0004 1.0651 -0.6641
dipole: 2.3616
quadrupole: -94.1555 -100.5642 -100.9819
quadrupole: 0.2318 0.1397 1.2478
quadrupole: 4.4117 -1.9970 -2.4147 0.2318 0.1397 1.2478
hfenergy: -699.7492791 hartree
pointgroup: C01 [X(C14H28O2)]
dipole: -0.7710983 0.5121792 0.0797799 debye
polarizability: 175.8040094|-4.1818478|159.6214808|5.73265|1.4414716|151.2440634 unknown
InChI: InChI=1S/C14H28O2/c1-7-14(6,11-9-10-12(3)4)16-13(5)15-8-2/h7,12-13H,1,8-11H2,2-6H3
charge 0 multiplicity 1
44 atoms
O  -0.858245 -0.296399 1.262376
O  -2.272801 -1.087813 -0.464624
C  -0.523581 1.153774 0.979236
C  1.031283 1.161894 1.03175
C  1.739308 0.330419 -0.060297
C  3.255409 0.201922 0.212324
C  4.058344 -0.511015 -0.908977
C  -1.094269 2.00781 2.130031
C  -1.030373 1.549838 -0.400747
C  3.620398 -1.984542 -1.090859
C  5.576937 -0.429156 -0.623136
C  -2.198321 -0.735699 0.971941
C  -2.45819 -1.972982 1.831711
C  -1.802295 2.626785 -0.692714
C  -3.586817 -0.812218 -1.070284
C  -3.494435 -1.185997 -2.55001
H  1.371514 2.215586 0.986573
H  1.318833 0.766688 2.027008
H  1.593959 0.802354 -1.053145
H  1.265536 -0.667021 -0.100257
H  3.412234 -0.344115 1.167404
H  3.681636 1.217272 0.361073
H  3.858089 0.02704 -1.861176
H  -0.714946 1.620614 3.091118
H  -2.198768 1.981067 2.156435
H  -0.782358 3.063316 2.033195
H  -0.719287 0.873958 -1.206186
H  4.216487 -2.479604 -1.880387
H  2.555116 -2.066819 -1.370537
H  3.768251 -2.550523 -0.150194
H  5.913034 0.620863 -0.529447
H  5.82402 -0.94865 0.323376
H  6.164199 -0.904657 -1.431049
H  -2.941046 0.072237 1.170287
H  -2.44445 -1.713991 2.904672
H  -3.438591 -2.416633 1.582261
H  -1.672258 -2.721284 1.635498
H  -2.094723 2.848072 -1.725701
H  -2.153682 3.328193 0.072947
H  -3.833021 0.265854 -0.945431
H  -4.377308 -1.411147 -0.566443
H  -4.460826 -1.006777 -3.056215
H  -2.717478 -0.584226 -3.0527
H  -3.230816 -2.251686 -2.663399
