program: Gaussian 09
title: 000163461
version: EM64L-G09RevD.01
frameworkgroup: C1[X(C20H26N2O3)]
method: RPBEPBE
basis: SDD
operation: Freq
keyword: #p
keyword: freq=noraman
keyword: PBEPBE/SDD
title: #p freq=noraman PBEPBE/SDD
converged: YES YES NO NO
title: Mulliken charges:
elementType: O O O N N C C C C C C C C C C C C C C C C C C C C H H H H H H H H H H H H H H H H H H H H H H H H H H
charge: -0.482060 -0.447962 -0.265702 -0.028785 -0.018644 -0.213216 0.411855 -0.026241 -0.503749 -0.588491 -0.481714 -0.477254 -0.486826 -0.379561 -0.691716 0.434009 0.268169 -0.323840 -0.069897 -0.536278 -0.396517 -0.314970 0.292474 -0.361409 -0.537227 0.216380 0.241323 0.259650 0.212475 0.225850 0.254752 0.222656 0.210265 0.233791 0.234888 0.194754 0.216804 0.248923 0.321750 0.230751 0.218130 0.210456 0.346191 0.254265 0.244267 0.233719 0.258589 0.245452 0.246424 0.221830 0.221217
chargesum: 0.00000
title: Mulliken charges with hydrogens summed into heavy atoms:
elementType: O O O N N C C C C C C C C C C C C C C C C C C C C
charge: -0.160310 -0.101771 -0.265702 -0.028785 -0.018644 0.003164 0.411855 0.215082 -0.031624 -0.107889 -0.048793 -0.008575 -0.075269 -0.130638 -0.032380 0.434009 0.268169 -0.069575 -0.069897 -0.292010 -0.162798 -0.056380 0.292474 -0.115957 0.152244
polarizability: 2.57982212e+02 1.91508596e+01 2.90471991e+02 -2.20014667e+01 8.53984579e+00 1.72496693e+02
1716.lowfreq: -15.7611 -8.3630 -0.0005 -0.0003 0.0001 4.5272 11.4622 19.7307 34.7496
frequency: -12.3004 19.6611 34.4051 52.0534 77.0306 101.9920 112.8776 126.9874 134.8771 169.1760 179.3397 192.9233 210.3626 214.6048 227.4860 237.6838 267.4790 280.3157 293.2201 310.6535 317.0530 321.5307 333.6761 338.8544 363.1125 386.2657 410.7885 421.8083 438.5164 446.1482 470.2492 490.7973 519.8771 539.3166 546.4250 551.6765 586.1698 594.8658 601.7621 632.5201 674.5672 684.5317 692.9943 749.4648 781.6410 783.1394 791.3291 799.8632 826.4811 830.8786 845.6868 851.1757 866.7945 870.5976 877.0166 878.8871 916.5275 918.9964 952.3581 953.6997 960.5422 966.7165 977.9137 996.9064 1004.4359 1013.7439 1014.1371 1028.2943 1056.0610 1071.0903 1077.1511 1087.8464 1094.5123 1103.0240 1111.2087 1125.0922 1135.0589 1147.3576 1157.9417 1160.0796 1186.4961 1191.7281 1209.3318 1222.1348 1228.0944 1243.9481 1247.8793 1256.6684 1264.2382 1278.8718 1287.4539 1298.9008 1304.9323 1312.1907 1317.1238 1321.1680 1327.8179 1332.1737 1343.1847 1344.4114 1362.6636 1365.1586 1367.9675 1383.1573 1392.0576 1427.1896 1437.3918 1454.1306 1458.8477 1459.9178 1461.2341 1469.1521 1471.4783 1474.2304 1474.5205 1485.1674 1490.5635 1508.2921 1549.2056 1578.2638 1630.6483 2949.2873 2960.8825 2981.9912 2985.0908 2990.7424 2993.0290 3005.1345 3007.8464 3017.4938 3019.8231 3023.0812 3042.0926 3049.5081 3068.6513 3073.9728 3083.1622 3091.0160 3094.8713 3119.5570 3124.8813 3151.4910 3154.4703 3162.7766 3173.4400 3530.0815 3564.7933
redmass: 4.1231 4.4376 4.5819 4.7281 3.4869 4.1389 2.6140 2.8231 3.5115 3.3260 3.3125 3.4462 1.3808 2.6708 2.9601 1.3863 2.7098 2.4544 1.5121 2.2795 1.4465 3.5086 2.8571 2.9090 3.1534 4.3205 3.5724 2.6901 2.7437 2.9790 3.7833 3.9553 5.2813 3.7602 3.4770 4.7101 3.7580 3.5537 5.6624 5.5720 4.2348 4.1737 6.0028 5.2891 1.7100 1.9283 2.0482 1.5998 1.7527 2.6659 2.2949 3.6741 1.7931 1.9548 2.7812 2.6734 2.9607 2.5917 2.0248 3.6852 1.5869 1.3732 2.1533 2.8643 4.2917 3.1132 2.8371 1.9360 2.4919 2.4900 2.3085 2.2668 2.0642 1.5594 1.2565 1.9519 1.3900 1.6955 1.2753 1.3116 2.0790 1.3965 1.3107 1.6533 2.1544 1.4367 1.4560 2.5838 1.5539 1.4602 1.3578 1.3978 1.6090 1.3183 1.4825 1.4007 1.3662 1.3911 1.6763 1.6771 1.7493 1.5873 1.7572 3.4584 1.2049 2.2472 1.5056 1.0797 1.3053 1.8141 1.0905 1.0504 1.0698 1.0718 1.0882 1.0849 1.0564 3.8232 6.7633 6.8196 6.9329 1.0646 1.0329 1.0761 1.0366 1.0818 1.0637 1.0646 1.0841 1.0858 1.0726 1.0676 1.1026 1.1041 1.1053 1.0993 1.1015 1.0997 1.1004 1.0889 1.0994 1.0870 1.0947 1.0906 1.0972 1.0656 1.0662
irintensity: 0.7535 0.1684 0.1720 0.1367 5.0951 0.5994 0.4192 0.2069 1.5420 0.6782 0.8507 9.4763 1.2182 0.6234 3.5459 1.6862 14.7839 14.3100 45.7432 50.3683 77.6870 10.8254 16.9968 13.4118 27.7854 2.7164 3.4157 3.5013 10.3650 2.5850 4.3348 7.4460 11.3983 4.4083 0.5993 10.6494 8.2139 0.8597 10.1853 6.7182 0.3498 3.1759 11.0983 3.8889 4.8563 0.9346 29.7177 23.5804 15.8247 8.0395 21.1856 5.8953 56.4102 4.9752 16.2212 3.8100 7.6135 22.6624 13.3101 59.9568 3.9145 2.2728 37.4928 9.6397 58.0544 10.8371 9.7464 3.4311 15.3587 22.7464 19.2281 11.8015 6.3622 34.0948 0.1906 13.7691 7.0082 2.7799 17.2145 10.0680 122.8672 2.4127 6.5955 15.0441 11.8187 35.0151 3.3792 87.8428 27.8142 14.7284 17.4587 0.6100 9.1469 1.1790 9.2623 6.8758 8.0415 2.4961 2.4827 2.2534 6.9696 4.2275 8.7606 3.8175 15.6379 6.4501 7.7914 7.3921 18.3928 29.7008 2.4434 12.5452 17.4809 7.5644 29.7310 13.1688 15.2611 91.7693 26.5749 11.4529 91.3466 35.6486 86.5729 14.0253 30.1785 0.7307 60.2928 71.9819 32.8639 29.9202 61.1712 13.8556 8.6830 46.9059 56.1803 52.0326 18.4886 16.7792 28.2700 25.9114 22.6987 3.6499 15.2301 7.7933 14.0689 3.1634 9.0463
temp: 298.150 k
press: 1.00000 atm
elementType: 8 8 8 7 7 6 6 6 6 6 6 6 6 6 6 6 6 6 6 6 6 6 6 6 6 1 1 1 1 1 1 1 1 1 1 1 1 1 1 1 1 1 1 1 1 1 1 1 1 1 1
symmnumber: 1
zpe: 1118684.5 jmol-1
zpe.correction: 0.426084 hartree
zpe.thermalcorrener: 0.448406 hartree
zpe.thermalcorrenthalpy: 0.449350 hartree
zpe.thermalcorrgfe: 0.375598 hartree
zpe.sumelectzpe: -1110.986416 hartree
zpe.sumelectthermal: -1110.964095 hartree
zpe.sumelectthermalent: -1110.963151 hartree
zpe.sumelectthermalfe: -1111.036903 hartree
dipole: -2.2052 2.7934 0.2091
dipole: 3.5651
quadrupole: -133.3040 -138.5393 -149.6391
quadrupole: 14.0512 4.2260 -2.8002
quadrupole: 7.1901 1.9548 -9.1449 14.0512 4.2260 -2.8002
hfenergy: -1111.4125005 hartree
pointgroup: C01 [X(C20H26N2O3)]
dipole: -0.8424936 1.1212095 0.0195429 debye
polarizability: 258.2098746|18.3875887|290.2751482|-24.2579023|0.9563583|172.4658727 unknown
InChI: InChI=1S/C20H26N2O3/c1-3-20(24)12-22-9-7-13(20)10-18(22)19(23)15-6-8-21-17-5-4-14(25-2)11-16(15)17/h4-6,8,11,13,18-19,23-24H,3,7,9-10,12H2,1-2H3
charge 0 multiplicity 1
51 atoms
O  -2.752542 1.681917 1.421745
O  -0.512243 -2.159864 2.426534
O  2.644141 3.073229 0.439488
N  -1.505563 -0.636374 -0.855411
N  3.392761 -2.358801 -0.84189
C  -3.800639 -0.28964 0.299892
C  -3.110222 1.097853 0.096846
C  -1.553217 -1.444789 0.406851
C  -2.890083 -1.182043 1.18632
C  -1.739203 0.816854 -0.606787
C  -4.001801 -1.001594 -1.070447
C  -2.591302 -1.135681 -1.757086
C  -4.006888 2.10577 -0.665835
C  -0.299788 -1.226456 1.291468
C  -3.385579 3.511486 -0.815631
C  1.001212 -1.557277 0.566214
C  1.981864 -0.562628 0.190779
C  1.271349 -2.895022 0.251662
C  3.163154 -1.025809 -0.523996
C  1.870689 0.829656 0.487948
C  2.464114 -3.250872 -0.447374
C  4.153083 -0.076575 -0.925073
C  2.864654 1.731942 0.085869
C  4.018445 1.280964 -0.634957
C  3.643084 4.06484 0.033116
H  -4.78133 -0.141302 0.795841
H  -1.513942 -2.504593 0.088575
H  -2.683236 -0.681781 2.146422
H  -3.400496 -2.134805 1.414186
H  -1.689621 1.324595 -1.586096
H  -0.931841 1.231122 0.016787
H  -4.710702 -0.448941 -1.713283
H  -4.44674 -1.99759 -0.885748
H  -2.371287 -2.186736 -2.015649
H  -2.546367 -0.546962 -2.691505
H  -4.979375 2.188045 -0.133084
H  -4.238944 1.699032 -1.669305
H  -0.295165 -0.189522 1.679368
H  -3.590158 1.855275 1.925156
H  -3.119842 3.929381 0.170663
H  -2.462238 3.486126 -1.423013
H  -4.092936 4.201215 -1.311112
H  0.288975 -2.130528 3.008574
H  0.56284 -3.675255 0.547344
H  1.019652 1.233572 1.042806
H  2.663516 -4.300103 -0.696787
H  5.022745 -0.462101 -1.465835
H  4.792714 1.985129 -0.952894
H  3.258926 5.02454 0.408777
H  3.743445 4.11072 -1.068692
H  4.630627 3.856483 0.48876
