program: Gaussian 09
title: 000163280
version: EM64L-G09RevD.01
frameworkgroup: C1[X(C15H17N)]
method: RPBEPBE
basis: SDD
operation: Freq
keyword: #pfreq=noraman
keyword: PBEPBE/SDD
title: #p freq=noraman PBEPBE/SDD
converged: YES YES NO NO
title: Mulliken charges:
elementType: N C C C C C C C C C C C C C C C H H H H H H H H H H H H H H H H H
charge: -0.444055 0.332492 0.129599 -0.481549 0.369780 0.415861 -0.394804 -0.469220 -0.875857 -0.237055 -0.846355 -0.441270 -0.388813 -0.221825 -0.222783 -0.239426 0.218204 0.224174 0.316866 0.236133 0.225785 0.223144 0.257952 0.232835 0.216271 0.226956 0.230885 0.226630 0.236054 0.258171 0.227647 0.227450 0.230126
chargesum: 0.00000
title: Mulliken charges with hydrogens summed into heavy atoms:
elementType: N C C C C C C C C C C C C C C C
charge: -0.127190 0.332492 0.129599 -0.039171 0.369780 0.415861 -0.158671 -0.243435 -0.161926 -0.020784 -0.161885 -0.205216 -0.130642 0.005822 0.004666 -0.009299
polarizability: 2.45165879e+02 1.03211452e+01 1.57626514e+02 -1.15834298e+01 8.12256414e+00 1.05808313e+02
1716.lowfreq: -7.3368 -0.0008 -0.0006 -0.0005 4.9426 9.3532 23.5665 28.5082 56.4949
frequency: 23.4564 28.4473 56.4875 94.7440 137.6935 164.7395 175.5545 191.0606 218.5435 226.5959 281.3912 293.5013 332.8230 363.1718 395.5221 409.6366 461.4040 494.2752 501.1766 522.5785 536.2866 572.9122 591.8017 616.8811 703.4339 711.5218 719.0949 752.2414 773.7892 805.7872 826.2903 856.5685 857.2405 889.5047 919.0331 955.7386 979.6941 987.4668 991.7703 992.2067 998.6683 1025.6221 1026.2792 1048.4403 1048.6453 1084.3872 1098.1484 1140.8795 1172.3050 1182.7877 1185.4477 1195.1781 1208.5805 1222.0981 1259.5246 1301.4743 1323.0559 1347.3488 1376.5599 1387.0994 1393.9396 1400.6950 1431.3145 1440.1132 1458.3353 1467.2381 1468.4367 1482.2697 1490.9111 1492.4316 1498.5655 1514.7014 1594.2606 1599.3319 1610.9531 1615.8797 2914.7996 2943.2762 2967.1505 2970.5211 3006.1198 3045.1146 3081.5906 3106.9360 3119.7174 3120.2435 3124.6852 3137.0403 3141.3069 3147.6725 3162.3526 3164.0366 3572.9614
redmass: 3.7398 4.0313 4.1999 3.3264 1.6297 3.6292 1.6888 1.1006 3.5449 3.0267 2.8444 3.5878 2.5912 1.9823 1.7087 2.0416 3.2244 4.6362 3.1504 3.7235 4.3799 3.6610 4.8791 6.3420 2.3941 3.1964 1.9841 1.7035 1.7254 4.6597 3.5927 1.2855 1.3325 2.2593 1.3803 1.3191 1.3904 2.3905 1.6956 2.1053 1.4103 1.5027 2.0445 2.1570 1.6577 1.5650 1.8960 2.8980 1.0547 1.6512 1.1212 1.8956 1.3607 1.8970 1.7557 1.6416 1.5476 1.8066 3.5929 4.5149 1.3679 1.2252 1.9175 2.1372 1.7714 1.2974 1.1737 1.9783 1.1211 1.1567 1.1767 1.8792 6.0826 5.5881 6.3200 6.1208 1.0641 1.0431 1.0953 1.0377 1.0957 1.0975 1.0977 1.0917 1.0861 1.0856 1.0869 1.0917 1.0928 1.0963 1.0966 1.1016 1.0763
irintensity: 0.1272 0.0150 0.4300 1.8179 0.0324 0.6010 2.4330 4.2353 0.5950 0.3800 3.7179 3.4898 0.3463 42.1839 66.7395 36.0863 1.6288 2.0085 0.5711 4.0466 10.3483 1.2560 4.9939 0.2581 29.6310 20.2523 10.0604 50.6300 67.6642 0.6358 2.4120 0.1810 0.2071 0.3776 4.5405 0.4369 0.3495 3.4772 14.1163 2.1930 1.3428 8.8839 10.1416 3.4248 1.6406 12.6470 17.8382 33.5732 0.0550 1.2092 1.6294 0.1759 8.6722 8.3082 1.4902 39.2380 25.1689 25.5866 34.3012 12.7438 1.4350 11.7736 9.9788 17.8426 23.1748 57.5813 46.1314 37.1865 28.6475 30.9092 19.9488 110.6475 0.9906 25.1253 181.3773 0.1865 68.4754 41.1618 25.3046 40.7267 25.6249 24.1761 26.2206 17.3617 6.6070 4.8693 0.4142 16.6738 42.0853 39.1686 22.7705 22.8126 24.7328
temp: 298.150 k
press: 1.00000 atm
elementType: 7 6 6 6 6 6 6 6 6 6 6 6 6 6 6 6 1 1 1 1 1 1 1 1 1 1 1 1 1 1 1 1 1
symmnumber: 1
zpe: 728104.1 jmol-1
zpe.correction: 0.277320 hartree
zpe.thermalcorrener: 0.292386 hartree
zpe.thermalcorrenthalpy: 0.293330 hartree
zpe.thermalcorrgfe: 0.233934 hartree
zpe.sumelectzpe: -635.400729 hartree
zpe.sumelectthermal: -635.385664 hartree
zpe.sumelectthermalent: -635.384719 hartree
zpe.sumelectthermalfe: -635.444115 hartree
dipole: 1.8098 0.9818 -0.5500
dipole: 2.1311
quadrupole: -88.9133 -89.7509 -97.6533
quadrupole: -1.5119 -1.5561 1.9059
quadrupole: 3.1925 2.3549 -5.5474 -1.5119 -1.5561 1.9059
hfenergy: -635.6780494 hartree
pointgroup: C01 [X(C15H17N1)]
dipole: -0.7143898 0.4222127 0.1198367 debye
polarizability: 244.9638676|-12.4760085|149.0259292|-11.4585363|-20.440143|114.6109095 unknown
InChI: InChI=1S/C15H17N/c1-12-7-6-10-15(13(12)2)16-11-14-8-4-3-5-9-14/h3-10,16H,11H2,1-2H3
charge 0 multiplicity 1
33 atoms
N  0.026063 0.003615 0.169565
C  1.395661 -0.291757 0.102585
C  2.336134 0.782398 -0.065736
C  -1.009149 -1.013615 0.385776
C  3.72358 0.488475 -0.15329
C  -2.403716 -0.428762 0.199155
C  1.860275 -1.6353 0.182762
C  4.16675 -0.859852 -0.080534
C  1.804004 2.203578 -0.15269
C  3.238806 -1.908388 0.085177
C  4.757266 1.592863 -0.330828
C  -3.399327 -0.602962 1.191198
C  -2.732376 0.282583 -0.984666
C  -4.701684 -0.083494 1.005905
C  -4.03044 0.80716 -1.169846
C  -5.020492 0.624527 -0.175094
H  -0.929532 -1.474236 1.396444
H  -0.852772 -1.834187 -0.345661
H  -0.252338 0.971047 0.328536
H  1.155739 -2.458745 0.332446
H  5.238221 -1.078545 -0.150695
H  1.285195 2.509477 0.780748
H  2.607304 2.935467 -0.324682
H  1.074679 2.311376 -0.981629
H  3.588765 -2.94541 0.146935
H  4.735301 2.31903 0.504217
H  5.774132 1.16716 -0.374619
H  4.595692 2.165195 -1.26447
H  -3.154102 -1.145002 2.112822
H  -1.966933 0.416026 -1.758126
H  -5.461927 -0.226828 1.781975
H  -4.272761 1.351967 -2.089414
H  -6.028318 1.029538 -0.319765
