program: Gaussian 09
title: 000163098
version: EM64L-G09RevD.01
frameworkgroup: C1[X(C13H7NO2)]
method: RPBEPBE
basis: SDD
operation: Freq
keyword: #p
keyword: freq=noraman
keyword: PBEPBE/SDD
title: #p freq=noraman PBEPBE/SDD
converged: NO YES YES YES
title: Mulliken charges:
elementType: O O N C C C C C C C C C C C C C H H H H H H H
charge: -0.138350 -0.134330 -0.028009 0.384568 -0.137011 0.289019 0.321730 -0.216617 -0.195136 -0.381988 -0.366913 -0.270448 -0.220530 -0.233279 -0.175627 -0.355316 0.298067 0.289945 0.293431 0.240016 0.242673 0.242266 0.251839
chargesum: 0.00000
title: Mulliken charges with hydrogens summed into heavy atoms:
elementType: O O N C C C C C C C C C C C C C
charge: -0.138350 -0.134330 -0.028009 0.384568 -0.137011 0.289019 0.321730 -0.216617 -0.195136 -0.083921 -0.076968 0.022983 0.019486 0.009394 0.066639 -0.103477
polarizability: 2.24994069e+02 -3.17019554e+00 1.83705592e+02 6.12234171e-03 -1.10381689e-02 5.59669146e+01
1716.lowfreq: -6.8092 -3.3004 -0.0006 0.0005 0.0007 9.2312 47.0557 85.3475 127.6737
frequency: 47.0552 85.3471 127.6736 151.5467 223.5638 257.6615 305.6852 348.8751 375.3965 387.0381 390.6638 419.5862 437.2043 448.5162 550.6168 558.3923 599.5856 610.4454 665.0100 673.5694 734.0620 753.1716 794.0386 805.5702 815.9844 892.5889 903.2447 941.9518 966.8722 985.1381 999.1238 1008.1594 1011.4666 1017.7842 1042.8041 1057.7830 1075.9301 1114.0165 1173.2142 1192.4428 1221.7964 1271.2244 1285.3254 1299.7903 1319.8578 1390.6217 1414.5579 1430.0665 1447.5186 1482.1814 1542.8543 1555.6441 1566.6237 1585.2300 1592.1378 1616.7717 3134.4957 3137.7434 3151.1985 3154.3327 3165.6512 3176.2024 3176.7172
redmass: 11.2174 4.8002 4.5745 6.2756 4.9598 5.1558 8.0961 11.9933 5.2141 9.7377 8.3217 3.3168 4.4031 9.8671 4.9947 2.9781 7.2965 7.3535 7.1272 7.6971 3.5001 2.2328 6.3741 1.9895 1.3984 2.0801 9.0493 2.0618 1.5649 8.7126 1.3913 1.4247 6.3524 1.3785 2.0115 2.3222 2.3427 1.5749 1.0714 1.5067 2.5252 1.8943 2.7927 3.5869 3.9711 6.1653 2.5388 2.2833 2.6945 3.0170 7.1824 9.3444 7.0182 7.4281 8.0110 8.4279 1.0897 1.0864 1.0909 1.0908 1.0963 1.0997 1.0979
irintensity: 0.0960 6.8564 0.5815 0.3331 3.3192 0.0299 7.0533 4.0204 6.9486 0.1618 0.2297 7.1095 0.0002 0.8057 7.7669 0.3963 1.2223 2.4252 0.3526 1.6648 6.2561 58.2497 0.4555 52.8575 26.9827 0.1894 24.2259 0.0554 0.2166 8.8797 4.2136 0.4288 1.1766 0.6176 1.6419 4.8043 2.0034 11.4425 1.8347 1.5257 36.4554 12.4916 97.9344 29.2867 11.9905 13.5484 84.1606 30.8668 5.8834 4.2357 28.9659 315.5338 15.9787 13.4108 12.9471 19.1955 15.8762 3.8963 4.8335 1.5613 12.3215 23.1059 12.3011
temp: 298.150 k
press: 1.00000 atm
elementType: 8 8 7 6 6 6 6 6 6 6 6 6 6 6 6 6 1 1 1 1 1 1 1
symmnumber: 1
zpe: 431058.3 jmol-1
zpe.correction: 0.164181 hartree
zpe.thermalcorrener: 0.175528 hartree
zpe.thermalcorrenthalpy: 0.176472 hartree
zpe.thermalcorrgfe: 0.126331 hartree
zpe.sumelectzpe: -703.712714 hartree
zpe.sumelectthermal: -703.701368 hartree
zpe.sumelectthermalent: -703.700424 hartree
zpe.sumelectthermalfe: -703.750565 hartree
dipole: -0.6172 -5.0814 0.0002
dipole: 5.1187
quadrupole: -67.4358 -105.0463 -92.7985
quadrupole: -0.6086 0.0060 -0.0002
quadrupole: 20.9910 -16.6194 -4.3716 -0.6086 0.0060 -0.0002
hfenergy: -703.8768957 hartree
pointgroup: C01 [X(C13H7N1O2)]
dipole: -0.2328539 2.0003441 -0.0000634 debye
dipolederiv: -0.4352053 0.2369375 -0.000046 -0.0092693 -0.903079 0.0000504 -0.0001161 0.0004137 -0.2846542 -0.4887321 -0.2474627 0.0000122 -0.0713891 -0.8541325 0.0000843 -0.0001733 -0.0004189 -0.2827508 -0.7651757 0.1673241 0.0000292 0.3121372 -0.3406419 -0.0000169 0.0001457 -0.0000755 -0.2261207 -0.0958606 0.0203813 -0.0000201 0.1491483 0.1605212 0.0000127 -0.0000974 -0.0002556 0.0250814 0.9335661 -0.0471174 -0.0000771 -0.0328913 0.2314056 -0.000049 -0.0000925 0.00017 0.0330895 -0.2581042 -0.3470263 0.0000797 -0.2348457 -0.5376343 0.000199 -0.0000427 0.0001178 0.0019018 -0.5503831 0.3331733 0.0000523 -0.1124869 -0.5641887 -0.0000811 -0.000168 0.0001458 0.0596818 0.5184586 0.1437963 -0.0000337 0.1895945 1.2185566 -0.0003683 0.0002137 -0.0005013 0.1637624 0.5764211 -0.113535 0.0000145 -0.0897025 1.176924 0.0001642 0.0003679 0.0003747 0.162653 -0.3357075 -0.3035633 0.0000497 -0.117653 -0.0606954 0.0000073 -0.0000092 0.0000493 -0.122259 -0.1338161 0.098762 -0.0000249 -0.2472388 0.0858789 0.000003 0.0000629 -0.0000286 -0.0906316 0.1760671 -0.1543046 -0.0000244 0.1263046 0.1867319 -0.0000511 0.0000056 -0.000032 -0.0653832 0.216853 0.2101859 -0.0000464 0.0744857 0.1247651 -0.0000449 -0.0000626 -0.0000633 -0.1235671 0.1323253 0.0106265 -0.0000205 0.1977899 -0.1361087 -0.0000093 0.0000061 0.0000328 -0.1531487 0.0034527 -0.0642163 0.0000018 0.0239738 -0.3850842 0.00002 0.0000541 -0.0001046 -0.1253571 0.3637224 -0.0179126 -0.0000255 -0.2214978 0.4125377 -0.0000127 -0.000101 -0.0000255 -0.0361278 0.130529 0.0664131 -0.0000022 0.0439025 0.0314963 0.0000087 0.0000492 0.0000371 0.153868 0.0820394 0.0171489 0.000007 0.0789579 0.0259826 0.0000087 -0.0000428 -0.0000002 0.1541182 0.0965464 -0.0187689 0.0000069 -0.0850418 0.0428683 0.0000244 -0.0000324 0.0000536 0.1456214 0.0273753 -0.0808366 0.0000239 -0.1078504 -0.0517284 0.0000377 0.0000237 0.0000097 0.1536107 -0.1153298 -0.0148015 0.0000226 0.0011616 0.0923683 0.00001 0.0000088 0.0000171 0.1609949 -0.0979284 0.031285 0.0000166 0.0137604 0.0960751 0.0000005 0.0000225 -0.0000045 0.1646829 0.0188866 0.0735115 0.0000044 0.1186503 -0.0528182 0.0000023 -0.0000224 0.0000885 0.1309343 unknown
polarizability: 225.0246774|2.9640237|183.6749841|-0.0061773|-0.0110075|55.9669146 unknown
InChI: InChI=1S/C13H7NO2/c15-12-9-5-2-1-4-8(9)11-10(13(12)16)6-3-7-14-11/h1-7H
charge 0 multiplicity 1
23 atoms
O  1.353983 -2.902131 0.001046
O  -1.450815 -2.865234 -0.000568
N  -1.365482 1.992595 -0.000008
C  0.738442 0.752999 -0.000061
C  -0.744318 0.767403 0.000022
C  1.45442 -0.48409 0.00005
C  -1.487424 -0.453396 0.000214
C  0.747179 -1.794921 0.000171
C  -0.808447 -1.77919 0.000385
C  1.462616 1.970339 -0.000242
C  2.873656 -0.479155 -0.000041
C  -2.904429 -0.392803 0.000262
C  2.873355 1.962999 -0.000356
C  3.584009 0.736434 -0.000253
C  -3.53889 0.862268 0.000219
C  -2.725361 2.023928 0.000089
H  0.895276 2.904936 -0.000301
H  3.391432 -1.44399 0.000045
H  -3.467886 -1.331458 0.000373
H  3.420609 2.911879 -0.000542
H  4.678861 0.733901 -0.000344
H  -4.628871 0.951915 0.000294
H  -3.177214 3.022473 0.000047
