program: Gaussian 09
title: 000163078
version: EM64L-G09RevD.01
frameworkgroup: C1[X(C19H26O8)]
method: RPBEPBE
basis: SDD
operation: Freq
keyword: #pfreq=noraman
keyword: PBEPBE/SDD
title: #p freq=noraman PBEPBE/SDD
converged: NO YES NO NO
title: Mulliken charges:
elementType: O O O O O O O O C C C C C C C C C C C C C C C C C C C H H H H H H H H H H H H H H H H H H H H H H H H H H
charge: -0.289364 -0.256220 -0.241733 -0.449848 -0.464813 -0.273505 -0.286495 -0.249957 0.255646 0.373293 0.306945 -0.377134 -0.156562 -0.480224 -0.170895 -0.182387 -0.855456 -0.560654 -0.487344 -0.207745 -0.422831 0.467803 0.325694 -0.824471 -0.762049 0.300065 -0.759201 0.283248 0.287937 0.230911 0.226462 0.294501 0.260180 0.264833 0.219843 0.246006 0.250606 0.248076 0.267593 0.199587 0.252678 0.228376 0.374583 0.380545 0.232090 0.225868 0.246368 0.255154 0.257692 0.248433 0.248106 0.251537 0.248229
chargesum: 0.00000
title: Mulliken charges with hydrogens summed into heavy atoms:
elementType: O O O O O O O O C C C C C C C C C C C C C C C C C C C
charge: -0.289364 -0.256220 -0.241733 -0.075265 -0.084268 -0.273505 -0.286495 -0.249957 0.255646 0.373293 0.306945 -0.093886 0.131376 -0.022851 0.123606 0.077793 -0.124774 -0.061972 -0.020164 0.044933 -0.194454 0.467803 0.325694 -0.120145 -0.000770 0.300065 -0.011329
polarizability: 2.65051434e+02 3.31748406e+00 2.07660361e+02 -5.48178686e-01 2.33598705e+00 1.96768711e+02
1716.lowfreq: -13.3130 -9.5402 -0.0003 0.0004 0.0006 7.8878 11.2897 27.6484 31.5533
frequency: 8.1277 27.6419 31.4546 41.6496 59.9728 66.5252 72.7555 86.5499 101.5770 116.3399 120.9235 130.1040 150.8382 166.9663 177.0016 193.1353 199.3000 207.5930 221.6711 229.9353 234.8725 243.3137 255.7922 261.6580 292.5594 293.2429 297.1463 318.1711 329.3386 346.6145 354.7016 392.2428 401.4437 411.2475 425.0458 442.7682 465.0261 507.2567 515.9873 530.5596 533.9522 560.1879 570.9699 573.8559 590.7696 594.6657 626.4614 636.1846 683.9843 726.0858 743.5731 746.0258 762.1865 778.4301 794.1038 807.6912 852.6532 861.5113 863.3529 877.6704 882.6884 887.2081 899.7949 907.9193 926.8405 951.5831 964.8343 973.4258 987.3852 996.2441 1001.9541 1008.4379 1025.3774 1034.7635 1042.8181 1044.2981 1044.9121 1049.0662 1052.6766 1058.4355 1083.1754 1110.8245 1124.9569 1137.2678 1143.3126 1162.5426 1174.1982 1186.9620 1191.7994 1196.1874 1202.2025 1225.2545 1229.6703 1240.2082 1267.1328 1275.6122 1293.7003 1297.4856 1299.6447 1309.0052 1320.2960 1344.9793 1358.0108 1364.5490 1372.6073 1379.8214 1385.4467 1385.9399 1388.4527 1391.5837 1394.7421 1404.0244 1408.4236 1450.6499 1452.8723 1453.0907 1454.7421 1455.6290 1457.2320 1462.3862 1473.2281 1478.4278 1488.2643 1492.4209 1616.6282 1638.4972 1693.5392 2970.4698 2972.2714 2980.2647 2999.0782 3000.9927 3005.1549 3009.2586 3016.4539 3049.9038 3053.2409 3061.2292 3070.1932 3088.0463 3088.8830 3091.4734 3094.7623 3097.2472 3098.5280 3098.8226 3107.8749 3123.3422 3139.5664 3146.5499 3161.3073 3334.3368 3481.5423
redmass: 1.0380 1.1219 4.8895 5.6815 4.4916 4.0384 3.3042 4.2253 6.2407 4.6992 4.6129 3.8536 1.3935 3.0663 4.2591 5.2997 4.9865 2.4912 1.8039 4.2529 4.1984 4.4262 3.2616 3.8173 6.1372 3.3358 3.4251 2.8361 2.8056 3.3654 3.2430 1.8833 3.2428 3.3443 2.1561 4.0390 3.1640 3.9298 4.1225 3.7483 4.7881 4.4808 3.3686 3.4233 5.0068 3.9314 4.8140 4.6161 3.5210 2.8346 3.5511 1.5464 3.0263 3.6952 3.4038 3.7740 3.1124 4.1117 3.1516 3.9481 3.2710 3.4664 2.7204 2.2634 1.6028 2.3184 4.4068 2.2972 4.5823 1.8312 3.2870 2.4147 3.2630 2.4447 1.6570 1.6192 1.6328 1.4574 2.1473 1.9357 3.4683 2.2589 1.7241 2.1474 1.6994 3.5979 2.0906 1.8219 1.7432 2.5734 1.3762 1.5463 2.4673 2.5076 1.4763 1.3547 1.6048 1.4583 1.6292 1.2324 1.2871 1.2930 1.2654 1.5835 1.2865 1.5763 1.2410 1.2987 1.5055 1.4130 1.2708 1.6823 1.1352 1.0730 1.0602 1.0479 1.0810 1.0539 1.0495 1.0785 1.0646 1.2546 1.0937 1.0809 8.1878 9.9162 7.1799 1.0690 1.0381 1.0842 1.0712 1.0438 1.0387 1.0373 1.0648 1.0957 1.0857 1.0539 1.1002 1.0931 1.0897 1.0993 1.0900 1.0966 1.0933 1.0935 1.0999 1.0914 1.1026 1.1013 1.1180 1.0700 1.0655
irintensity: 0.4030 1.2883 0.8606 0.7558 4.8269 1.0444 2.9694 0.5539 2.3895 0.3122 3.2498 1.3294 1.1621 4.1620 1.9564 0.3032 8.7670 0.2933 1.5164 4.0179 15.8924 9.9315 3.4727 5.8740 7.0317 9.4349 0.3507 14.7281 3.6529 13.7549 0.5156 34.6395 8.9290 3.0524 26.2518 3.2314 37.8846 15.1882 11.0777 4.1382 3.2835 17.7907 2.0615 2.6087 3.1848 3.7817 9.2485 15.0079 43.1994 31.4183 39.6871 98.7479 5.3126 2.8431 15.8989 6.5457 11.2734 27.9925 14.2057 31.6063 2.5665 33.5485 10.2722 95.4718 19.2674 86.0715 70.2122 27.3775 63.3454 41.0028 13.9535 132.5219 58.2675 39.5312 10.5339 10.7478 15.2985 0.5256 3.7412 4.2198 27.4016 7.1740 3.1907 6.6016 39.6053 11.6049 9.8074 9.3700 183.3117 195.7557 11.3209 15.9271 240.6798 118.3683 6.8862 15.8518 2.9446 6.5519 12.1147 16.1910 5.7032 3.4138 43.4456 4.8602 5.3570 5.0997 42.7648 64.2746 9.4553 5.4475 22.6246 6.7789 21.2393 35.1632 20.2377 17.9032 1.3423 21.8705 17.3607 9.5027 16.5474 9.4726 7.4456 15.2115 162.0991 183.9138 11.3815 34.4709 28.4351 11.2200 4.7691 24.7284 2.5602 0.9918 12.4852 14.1478 5.8429 19.4537 16.1191 16.7667 7.9064 19.7740 15.8698 3.9785 20.1103 8.5948 5.5306 20.6581 7.3624 8.0218 14.6389 406.1471 17.7132
temp: 298.150 k
press: 1.00000 atm
elementType: 8 8 8 8 8 8 8 8 6 6 6 6 6 6 6 6 6 6 6 6 6 6 6 6 6 6 6 1 1 1 1 1 1 1 1 1 1 1 1 1 1 1 1 1 1 1 1 1 1 1 1 1 1
symmnumber: 1
zpe: 1119181.0 jmol-1
zpe.correction: 0.426274 hartree
zpe.thermalcorrener: 0.453947 hartree
zpe.thermalcorrenthalpy: 0.454891 hartree
zpe.thermalcorrgfe: 0.367275 hartree
zpe.sumelectzpe: -1339.266913 hartree
zpe.sumelectthermal: -1339.239240 hartree
zpe.sumelectthermalent: -1339.238296 hartree
zpe.sumelectthermalfe: -1339.325912 hartree
dipole: 1.5221 0.9873 1.5398
dipole: 2.3796
quadrupole: -150.4642 -153.2026 -173.3059
quadrupole: -8.0325 -10.3902 3.5157
quadrupole: 8.5267 5.7883 -14.3150 -8.0325 -10.3902 3.5157
hfenergy: -1339.6931866 hartree
pointgroup: C01 [X(C19H26O8)]
dipole: -0.6027949 0.6049007 -0.3837141 debye
polarizability: 264.5584603|-4.1712486|207.9007933|-4.9324459|2.4280159|197.0212526 unknown
InChI: InChI=1S/C19H26O8/c1-9-5-13-18(7-20,6-12(9)25-10(2)21)17(4)15(26-11(3)22)14(23)16(27-13)19(17)8-24-19/h5,12-16,20,23H,6-8H2,1-4H3
charge 0 multiplicity 1
53 atoms
O  2.08765 0.076287 -2.969487
O  0.21569 -2.386261 -0.724257
O  3.51249 0.573238 0.110083
O  2.732931 -2.725755 0.473645
O  0.482421 0.505345 2.533842
O  -3.511347 0.757719 0.745498
O  2.936227 1.757887 2.03415
O  -4.397386 1.897451 -1.090391
C  1.049191 0.396468 -0.579667
C  1.129306 -0.408244 -1.896709
C  -0.312153 -0.024787 0.151233
C  1.39033 -1.830729 -1.439519
C  2.267186 -0.250397 0.215636
C  0.602233 -0.034235 -3.234297
C  2.576295 -1.620955 -0.461157
C  -0.274394 -1.552099 0.453467
C  1.176983 1.913163 -0.803922
C  -1.541965 0.253512 -0.760586
C  -0.51265 0.75972 1.497922
C  -2.888201 -0.249058 -0.205878
C  -1.61535 -2.146827 0.803918
C  -2.815463 -1.560925 0.547161
C  3.749501 1.506457 1.104865
C  -4.135271 -2.17458 0.958753
C  5.098753 2.160532 0.931299
C  -4.243275 1.792984 0.148941
C  -4.776003 2.745882 1.196565
H  1.59652 -2.547253 -2.24847
H  2.042645 -0.384543 1.284043
H  0.3197 -0.823347 -3.943016
H  0.097311 0.929612 -3.372604
H  3.519443 -1.532392 -1.026775
H  0.422563 -1.72302 1.29894
H  2.040154 2.117701 -1.458874
H  0.277742 2.320511 -1.298737
H  1.314569 2.461838 0.141035
H  -1.399553 -0.274116 -1.720302
H  -1.63854 1.327909 -0.998372
H  -1.470441 0.450942 1.9415
H  -0.587781 1.842532 1.266435
H  -3.60096 -0.327673 -1.050694
H  -1.59118 -3.127873 1.294561
H  1.877015 -3.234452 0.478364
H  1.295491 1.079124 2.416801
H  -3.992967 -3.140517 1.471734
H  -4.7880 -2.340623 0.079398
H  -4.682165 -1.495877 1.639691
H  5.221466 2.517924 -0.104806
H  5.896579 1.419884 1.117995
H  5.20308 2.994867 1.638992
H  -4.056974 3.57418 1.336541
H  -4.907678 2.240027 2.164839
H  -5.727865 3.179041 0.852173
