program: Gaussian 09
title: 000163059
version: EM64L-G09RevD.01
frameworkgroup: C1[X(C23H24N3O)]
method: RPBEPBE
basis: SDD
operation: Freq
keyword: #p
keyword: freq=noraman
keyword: PBEPBE/SDD
title: #p freq=noraman PBEPBE/SDD
converged: YES YES NO NO
title: Mulliken charges:
elementType: O N N N C C C C C C C C C C C C C C C C C C C C C C C H H H H H H H H H H H H H H H H H H H H H H H H
charge: -0.251773 -0.135364 0.055000 -0.483992 0.504481 -0.404063 -0.401247 0.311780 -0.519857 0.001441 -0.340792 0.328808 -0.005742 -0.341260 0.525410 -0.533964 -0.647153 -0.643222 -0.294631 -0.440454 0.267582 0.284639 -0.363445 -0.365352 -0.822973 -0.230157 -0.225025 0.250791 0.240507 0.248977 0.240226 0.282405 0.260328 0.282606 0.316460 0.237467 0.230922 0.243888 0.235455 0.229053 0.245234 0.284547 0.253142 0.334953 0.273223 0.249293 0.258585 0.246568 0.231254 0.246228 0.249212
chargesum: 1.00000
title: Mulliken charges with hydrogens summed into heavy atoms:
elementType: O N N N C C C C C C C C C C C C C C C C C C C C C C C
charge: -0.251773 -0.135364 0.055000 -0.149039 0.504481 0.087236 0.087955 0.311780 -0.237452 0.001441 -0.080464 0.328808 -0.005742 -0.058654 0.525410 -0.217504 0.065124 0.066520 -0.010084 -0.187312 0.267582 0.284639 -0.090222 -0.116058 -0.086566 0.016071 0.024187
polarizability: 8.14005531e+02 -1.08415560e+00 3.18429429e+02 7.83824479e+00 8.07052503e-02 1.50213248e+02
1716.lowfreq: -11.8404 -2.2995 -0.0008 0.0001 0.0006 2.2447 23.1772 26.3428 33.9433
frequency: 23.1046 26.0698 33.6458 49.1891 61.1176 68.2923 81.6202 102.1304 118.2116 134.2241 163.7712 167.4858 183.7837 191.8233 212.5639 215.7161 223.0214 241.8456 270.9643 281.2907 296.0956 303.6529 342.5752 344.5948 394.7498 407.3275 438.6367 442.2850 448.6162 460.7594 466.4401 482.5245 507.9390 511.2852 536.1250 552.9539 559.2547 571.9580 604.5107 611.6795 630.0099 633.8834 647.6959 688.9880 707.3893 716.5979 723.0964 753.5519 765.1168 779.0666 785.8925 790.4091 808.5837 820.5293 829.4740 840.5288 847.5473 852.2671 862.5016 875.5371 891.5817 921.7250 936.5832 959.0909 962.5573 973.7841 975.6325 982.4026 996.4488 1010.3781 1043.1048 1049.6895 1069.4071 1072.2806 1092.2478 1101.4502 1111.1189 1122.0201 1152.5594 1154.2319 1176.9564 1182.0673 1183.3128 1194.4393 1232.7927 1244.9234 1255.7656 1274.6097 1277.0780 1285.6528 1292.9713 1313.7894 1335.6004 1340.5058 1355.9232 1368.5118 1379.6764 1388.5573 1394.9935 1398.0182 1402.7780 1412.4820 1437.3096 1459.4284 1469.0708 1470.3787 1474.3483 1475.7315 1480.6686 1481.5338 1483.6787 1492.7260 1499.4948 1504.1603 1512.3193 1513.6189 1527.2483 1537.6234 1548.9093 1586.6770 1610.6776 1619.8960 1661.1184 2962.3364 2995.1166 2995.6523 3019.2768 3023.2323 3042.2948 3067.5463 3072.1725 3096.9471 3097.7594 3099.8785 3100.0326 3101.5558 3139.3571 3141.2114 3146.7810 3160.0601 3169.3283 3176.3264 3180.5920 3187.8139 3190.2545 3193.8103 3500.1387
redmass: 3.7983 3.8933 4.3088 4.0228 4.1314 3.6958 3.3771 4.1937 4.1607 3.1595 1.1734 2.5369 2.7381 3.7853 1.0436 2.1165 3.0132 2.4395 5.9124 3.7408 4.2141 3.4370 3.3615 3.9207 3.5042 4.1563 3.5097 3.4085 4.0266 3.3107 3.1677 3.8358 3.5402 4.3413 3.9148 3.4524 7.8207 6.2087 2.9757 5.1543 2.3050 4.2688 2.7641 5.3553 5.0968 3.3775 3.8856 3.7359 1.5087 3.4006 1.3481 1.2018 2.8943 1.6003 1.6122 4.5894 4.3723 1.6024 1.4504 3.7734 1.3588 2.4011 2.4607 1.3645 2.5980 1.3249 1.3130 1.6131 1.3353 2.6939 1.5780 2.0494 2.4407 1.8457 1.7957 2.7180 2.4039 2.5002 1.6029 1.7835 1.9485 1.0754 2.0689 2.0080 2.1143 1.7895 1.6560 1.6235 1.3907 1.3022 1.8635 1.9678 1.2462 1.3330 2.6157 2.9502 5.1544 3.1588 1.2100 1.2442 1.2471 3.4866 2.1257 2.2205 1.0461 1.0424 1.0948 1.2104 1.1708 1.2229 2.1947 2.2065 1.3059 5.3238 1.5865 4.4073 4.6363 2.4509 2.9500 5.2416 5.4573 6.3854 7.7347 1.0436 1.0359 1.0359 1.0605 1.0612 1.0927 1.1030 1.1023 1.1002 1.0996 1.1024 1.0968 1.1021 1.0873 1.0905 1.0893 1.0946 1.0895 1.1009 1.0962 1.0928 1.0918 1.0956 1.0756
irintensity: 0.5735 0.0065 0.6382 0.1444 0.3104 1.1007 0.1008 0.7060 0.2064 1.3698 1.3019 0.6505 0.8938 1.2317 0.5929 0.7737 3.6289 1.3118 1.3947 1.2167 4.8638 1.1914 3.4163 4.8480 10.0476 9.1033 6.7828 0.4327 15.6215 1.1091 2.0977 7.8545 13.6502 6.7851 8.2415 2.2311 2.2074 1.1151 26.7779 2.1032 33.6651 20.5062 2.6644 34.3428 1.8174 5.8181 19.8828 0.6567 75.3978 9.0496 13.6811 9.4277 9.8701 26.6743 57.6090 25.5426 5.4869 36.4905 25.4179 13.4279 14.5545 0.6415 1.6719 0.3795 0.2468 0.1188 1.2015 2.1302 0.6254 42.2110 20.4422 5.2206 14.7163 88.8661 16.1024 7.5792 14.7613 52.1478 5.7228 69.5453 106.7367 7.5595 37.9166 3.8289 158.3340 19.6354 39.0137 43.7998 13.6915 5.1670 6.1999 15.0567 8.9014 218.2914 103.4469 2.6756 1.5073 351.6022 12.6248 27.5093 38.7204 682.9683 8.5494 155.9717 9.0555 17.3916 21.3788 12.5794 4.8346 0.9253 71.5204 25.2653 26.8079 202.3293 38.1056 12.8050 31.3251 37.2425 80.2104 33.3885 295.4991 1069.1489 48.0708 19.5777 19.1815 15.7729 30.4729 41.9135 13.8625 1.8902 0.7296 17.0828 41.4128 6.7785 19.2018 60.4454 9.5306 2.9734 2.7815 12.8075 0.0696 17.7577 2.4513 0.9338 0.3812 7.4669 224.2051
temp: 298.150 k
press: 1.00000 atm
elementType: 8 7 7 7 6 6 6 6 6 6 6 6 6 6 6 6 6 6 6 6 6 6 6 6 6 6 6 1 1 1 1 1 1 1 1 1 1 1 1 1 1 1 1 1 1 1 1 1 1 1 1
symmnumber: 1
zpe: 1097384.1 jmol-1
zpe.correction: 0.417972 hartree
zpe.thermalcorrener: 0.442271 hartree
zpe.thermalcorrenthalpy: 0.443215 hartree
zpe.thermalcorrgfe: 0.363053 hartree
zpe.sumelectzpe: -1128.207048 hartree
zpe.sumelectthermal: -1128.182748 hartree
zpe.sumelectthermalent: -1128.181804 hartree
zpe.sumelectthermalfe: -1128.261967 hartree
dipole: -2.9795 1.0869 0.5385
dipole: 3.2170
quadrupole: -7.9830 -125.5923 -157.4445
quadrupole: -16.6187 3.6007 -0.0800
quadrupole: 89.0236 -28.5857 -60.4379 -16.6187 3.6007 -0.0800
hfenergy: -1128.6250196 hartree
pointgroup: C01 [X(C23H24N3O1)]
dipole: -1.161223 -0.4648707 -0.1931843 debye
polarizability: 813.6191009|13.2878987|318.5446355|-8.9321299|-6.5787777|150.4844714 unknown
InChI: InChI=1S/C23H24N3O/c1-4-26(5-2)18-11-13-21-23(15-18)27-22-14-17(10-12-20(22)25-21)24-19-9-7-6-8-16(19)3/h6-15,24H,4-5H2,1-3H3
charge 1 multiplicity 1
51 atoms
O  -0.611417 -0.172678 -0.059516
N  -5.326854 -1.259258 -0.144475
N  -1.260547 2.616118 0.2295
N  4.107037 0.975625 0.037731
C  -4.321797 -0.327246 -0.054895
C  -5.047168 -2.697752 -0.408616
C  -6.76438 -0.903513 0.020534
C  -1.951066 0.251614 -0.015088
C  -2.937502 -0.71767 -0.111471
C  -2.236892 1.665274 0.140075
C  -4.627269 1.088032 0.097687
C  0.404524 0.792292 0.046484
C  0.039999 2.188889 0.181742
C  -3.623068 2.037095 0.189671
C  2.770764 1.314981 0.09075
C  1.720638 0.348808 0.001239
C  -4.760751 -3.503874 0.877614
C  -7.437192 -0.475642 -1.301595
C  1.115616 3.137281 0.255605
C  2.436085 2.718819 0.210119
C  4.712932 -0.321591 0.09107
C  5.873818 -0.553434 -0.709604
C  4.221395 -1.319896 0.972087
C  6.496092 -1.820621 -0.615267
C  6.420095 0.518067 -1.636174
C  4.858842 -2.574293 1.038339
C  5.997013 -2.829439 0.239053
H  -5.934318 -3.111871 -0.919112
H  -4.209967 -2.781214 -1.123285
H  -7.271546 -1.79687 0.426085
H  -6.862998 -0.11765 0.788373
H  -2.631978 -1.760763 -0.206758
H  -5.66665 1.420512 0.122234
H  -3.853778 3.100974 0.295688
H  1.929754 -0.713241 -0.137718
H  -3.872753 -3.121687 1.409696
H  -5.617842 -3.464493 1.57257
H  -4.581149 -4.562855 0.621622
H  -6.968182 0.429629 -1.724578
H  -7.376294 -1.27661 -2.059243
H  -8.505268 -0.259461 -1.123493
H  0.850413 4.193594 0.352971
H  3.245817 3.45425 0.276283
H  4.759682 1.757746 -0.074544
H  3.378221 -1.101063 1.634411
H  7.383364 -2.018769 -1.226637
H  7.254122 0.123538 -2.237958
H  5.649653 0.891698 -2.336185
H  6.819381 1.390989 -1.079508
H  4.482655 -3.338919 1.725304
H  6.499018 -3.800749 0.289181
