program: Gaussian 09
title: 000163066
version: EM64L-G09RevD.01
frameworkgroup: C1[X(C18H28N2O6S2)]
method: RPBEPBE
basis: SDD
operation: Freq
keyword: #p
keyword: freq=noraman
keyword: PBEPBE/SDD
title: #p freq=noraman PBEPBE/SDD
converged: YES YES NO NO
title: Mulliken charges:
elementType: S S O O O O O O N N C C C C C C C C C C C C C C C C C C H H H H H H H H H H H H H H H H H H H H H H H H H H H H
charge: 0.018592 0.018559 -0.287272 -0.287281 -0.412057 -0.412066 -0.228703 -0.228698 -0.161474 -0.161470 -0.136448 -0.136456 -0.476461 -0.476454 -0.471291 -0.471291 -0.378748 -0.378745 0.260803 0.260800 -0.144635 -0.144609 0.189784 0.189793 -0.733605 -0.733639 -0.695735 -0.695740 0.311946 0.311934 0.247099 0.240381 0.247108 0.240378 0.235462 0.244363 0.235463 0.244366 0.242744 0.239800 0.242735 0.239803 0.261447 0.261427 0.264108 0.304093 0.264127 0.304094 0.215826 0.230625 0.240903 0.215822 0.230634 0.240908 0.378476 0.378477
chargesum: 0.00000
title: Mulliken charges with hydrogens summed into heavy atoms:
elementType: S S O O O O O O N N C C C C C C C C C C C C C C C C C C
charge: 0.018592 0.018559 -0.287272 -0.287281 -0.033581 -0.033589 -0.228703 -0.228698 -0.161474 -0.161470 0.175498 0.175478 0.011018 0.011031 0.008534 0.008538 0.103795 0.103793 0.260803 0.260800 0.116812 0.116818 0.189784 0.189793 -0.165404 -0.165419 -0.008382 -0.008377
polarizability: 3.02497120e+02 1.23120125e-02 2.42162410e+02 1.98415499e+01 1.03510338e-03 2.31241168e+02
1716.lowfreq: -0.0016 -0.0009 0.0003 5.5362 6.1816 12.1966 15.4338 16.5408 19.8762
frequency: 12.1718 15.6910 19.8756 24.4543 25.3377 37.0245 37.0687 47.4924 52.2124 56.4106 64.1496 76.5687 84.0737 99.5837 125.7321 128.2826 137.0770 143.1005 146.4474 167.9736 173.6342 212.1790 214.8987 226.3727 241.1890 244.1445 244.5329 268.2901 269.5002 297.1292 297.7927 325.1453 326.6135 361.4896 366.5151 382.2879 382.7380 396.0448 396.6997 415.6710 517.6928 518.0878 553.7512 553.8925 591.2649 591.4047 621.5116 621.5966 650.1483 652.6481 667.6448 667.8038 703.0582 703.0633 717.5962 717.8081 780.7640 780.8065 821.5530 821.7920 870.8163 870.8619 880.3822 881.4231 899.0592 899.4813 915.4121 915.4421 921.0699 921.0785 960.3280 960.3781 994.8890 995.0821 1037.5511 1037.7520 1046.6301 1046.9258 1059.8604 1060.7567 1066.4693 1066.7780 1099.4653 1099.5514 1130.2238 1130.9326 1151.5749 1151.6117 1165.3791 1165.5411 1179.1844 1180.2024 1190.5242 1190.7456 1237.5578 1237.5712 1246.1814 1251.1120 1251.2103 1254.8617 1262.9926 1263.0816 1297.7936 1299.9385 1301.9596 1303.6128 1324.5307 1324.5949 1327.0710 1327.2653 1338.6203 1338.7432 1359.8648 1359.9378 1379.5844 1379.9335 1399.2903 1401.8357 1415.6827 1416.5884 1468.9705 1468.9789 1469.5864 1469.6036 1475.6116 1475.6475 1482.3736 1482.3834 1493.6449 1493.8176 1580.9867 1581.2328 1666.0862 1666.1608 2982.6928 2982.7404 2983.3716 2983.5301 3013.3879 3013.6046 3020.4342 3020.4684 3021.4616 3021.5357 3023.6651 3023.6709 3053.4795 3053.5192 3069.6654 3069.6738 3080.7446 3080.8651 3088.8156 3088.8259 3090.7828 3090.9134 3097.6000 3097.8563 3101.5849 3101.6365 3515.8250 3515.8368
redmass: 6.4762 6.5728 4.7340 5.5001 6.6009 7.1991 6.8785 8.1107 7.0505 7.7977 6.6522 5.2468 6.0273 4.0070 3.7009 4.1282 5.0329 4.5964 3.6465 2.9831 3.0890 1.1780 1.1207 2.7085 3.2548 2.4038 2.4095 2.2295 2.2738 3.6858 3.3187 5.5835 5.8127 5.6002 5.6627 5.0528 5.0797 5.5539 5.0113 13.6890 4.1497 4.1210 2.1903 2.1979 2.0242 2.0172 1.9935 1.9798 3.2683 3.2561 4.0928 3.9933 3.7573 3.7521 5.5666 5.6326 2.7643 2.7544 4.6188 4.6163 1.9097 1.9104 1.5948 1.5862 1.9436 1.9392 1.8054 1.8290 2.5549 2.5521 2.4214 2.4348 1.9634 1.9716 1.9927 2.0951 2.4890 2.5120 1.9886 1.9007 2.0163 2.0532 1.8501 1.8491 1.5023 1.5343 1.4365 1.4328 1.4910 1.4990 1.5790 1.6057 2.4646 2.4573 1.2603 1.2602 1.2195 1.5945 1.6042 1.2071 1.6561 1.6605 1.4208 1.4160 1.3134 1.3303 1.5372 1.5346 1.3896 1.3850 1.4195 1.4135 1.6498 1.6503 1.2704 1.2635 1.3204 1.2969 2.1082 2.1997 1.0598 1.0614 1.0739 1.0757 1.0883 1.0882 1.0777 1.0771 1.0937 1.0933 7.6575 7.6633 8.6281 8.6332 1.0585 1.0589 1.0379 1.0384 1.0602 1.0615 1.0634 1.0633 1.0786 1.0773 1.0661 1.0661 1.0997 1.0997 1.0859 1.0859 1.1005 1.1004 1.1020 1.1020 1.1011 1.1010 1.1056 1.1061 1.1052 1.1052 1.0641 1.0641
irintensity: 0.0174 2.6208 1.6287 0.0448 2.5721 0.1475 0.7392 4.4614 0.0087 1.6487 0.1180 8.1051 0.3922 0.6350 2.9967 0.0006 0.2229 0.4131 0.0898 0.5142 0.6240 0.0642 0.2407 1.6095 0.3825 6.5204 0.1183 0.9605 2.8337 7.3368 20.9142 0.9767 0.0037 38.4119 15.4947 2.4673 5.7153 6.0107 3.5857 0.3637 52.6782 4.5766 30.2151 15.6180 57.6905 45.4173 22.1558 90.3333 11.6468 16.7067 20.6853 1.3731 9.7500 39.4767 0.7689 15.8393 1.4940 2.5219 12.6373 23.9715 0.8520 6.2195 1.8869 19.3615 0.1109 1.4476 16.0698 35.8691 5.1616 3.7047 8.5627 0.2862 9.4915 1.3569 21.3266 134.4857 394.2702 105.0826 6.2650 31.9561 0.7391 3.7533 8.4561 10.9257 0.7932 15.4731 2.9422 5.9723 1.7899 2.5299 0.2930 0.0005 30.8532 0.1021 5.8491 6.8069 31.8210 23.2766 12.4535 0.7582 2.8394 15.5135 51.0941 2.6277 5.2583 8.9714 39.6852 34.2552 11.0835 23.9972 5.2189 4.1590 52.0434 0.2893 37.4580 0.1520 4.8214 6.6546 110.0049 236.6129 8.0494 19.6638 20.2413 8.6205 28.4485 6.0965 21.6987 25.5846 0.4760 1.0090 46.0447 349.1581 97.6903 236.4880 17.5257 51.6088 30.3432 24.8952 18.6162 16.2418 2.6826 38.4581 16.3818 26.1806 6.7059 13.4422 28.5473 11.5531 2.5857 6.4691 45.5568 24.0951 12.6938 23.2425 0.7705 32.3449 1.6716 13.2504 61.2918 3.9366 49.9947 6.6123
temp: 298.150 k
press: 1.00000 atm
elementType: 16 16 8 8 8 8 8 8 7 7 6 6 6 6 6 6 6 6 6 6 6 6 6 6 6 6 6 6 1 1 1 1 1 1 1 1 1 1 1 1 1 1 1 1 1 1 1 1 1 1 1 1 1 1 1 1
symmnumber: 1
zpe: 1183139.8 jmol-1
zpe.correction: 0.450634 hartree
zpe.thermalcorrener: 0.481952 hartree
zpe.thermalcorrenthalpy: 0.482896 hartree
zpe.thermalcorrgfe: 0.381613 hartree
zpe.sumelectzpe: -2057.553435 hartree
zpe.sumelectthermal: -2057.522116 hartree
zpe.sumelectthermalent: -2057.521172 hartree
zpe.sumelectthermalfe: -2057.622456 hartree
dipole: -0.0018 -2.3705 0.0000
dipole: 2.3705
quadrupole: -174.1097 -165.2236 -184.6207
quadrupole: -0.0005 -20.8028 -0.0035
quadrupole: 0.5417 9.4277 -9.9694 -0.0005 -20.8028 -0.0035
hfenergy: -2058.0040687 hartree
pointgroup: C01 [X(C18H28N2O6S2)]
dipole: -0.0001464 -0.9326158 -0.0001947 debye
polarizability: 301.7358457|0.0437621|242.1624398|21.1506634|0.0160329|232.0024117 unknown
InChI: InChI=1S/C18H28N2O6S2/c1-11(15(21)19-7-3-5-13(19)17(23)24)9-27-28-10-12(2)16(22)20-8-4-6-14(20)18(25)26/h11-14,23,25H,3-10H2,1-2H3
charge 0 multiplicity 1
56 atoms
S  0.413206 0.789475 1.060442
S  -0.41359 0.788374 -1.058833
O  4.024807 0.676612 1.84643
O  -4.025223 0.671767 -1.846291
O  7.093672 -1.693598 1.527146
O  -7.092119 -1.701367 -1.527522
O  7.008116 0.124051 0.080754
O  -7.008388 0.11645 -0.081231
N  4.181993 -0.321306 -0.23169
N  -4.181921 -0.326399 0.23174
C  5.040308 -1.391908 0.308693
C  -5.039183 -1.397729 -0.30886
C  5.057788 -2.446154 -0.836867
C  -5.055981 -2.452043 0.836661
C  4.926205 -1.580513 -2.116402
C  -4.925445 -1.586322 2.116251
C  3.953796 -0.45041 -1.697918
C  -3.953923 -0.45537 1.698016
C  3.722272 0.672142 0.607908
C  -3.722842 0.667457 -0.60773
C  2.880459 1.79975 -0.012891
C  -2.882424 1.795997 0.013327
C  6.450346 -0.86314 0.602876
C  -6.449611 -0.87018 -0.603331
C  1.724044 2.160578 0.930594
C  -1.726022 2.157936 -0.929758
C  3.801932 3.032448 -0.240471
C  -3.805201 3.027796 0.240428
H  4.63097 -1.78708 1.252282
H  -4.629304 -1.792518 -1.252375
H  5.96543 -3.070924 -0.82064
H  4.181184 -3.108431 -0.721123
H  -5.963056 -3.077628 0.820215
H  -4.178745 -3.11351 0.721077
H  4.547345 -2.151555 -2.979955
H  5.906899 -1.151191 -2.386508
H  -4.546284 -2.15706 2.979873
H  -5.906576 -1.157863 2.38614
H  2.9000 -0.72388 -1.901538
H  4.176273 0.496227 -2.220504
H  -2.899941 -0.727969 1.90183
H  -4.177307 0.491051 2.220606
H  2.450844 1.486901 -0.982035
H  -2.452863 1.483676 0.982667
H  1.216937 3.086641 0.613502
H  2.092808 2.265549 1.967507
H  -1.220144 3.084651 -0.612611
H  -2.094492 2.262308 -1.966843
H  3.234011 3.863798 -0.696166
H  4.645345 2.780291 -0.90832
H  4.226607 3.374696 0.71977
H  -3.238263 3.859768 0.696218
H  -4.648601 2.7749 0.908013
H  -4.229873 3.369516 -0.720003
H  8.008989 -1.344699 1.704368
H  -8.00776 -1.353358 -1.704818
