program: Gaussian 09
title: 000163000
version: EM64L-G09RevD.01
frameworkgroup: C1[X(C12H10O8S3)]
method: RPBEPBE
basis: SDD
operation: Freq
keyword: #p
keyword: freq=noraman
keyword: PBEPBE/SDD
title: #p freq=noraman PBEPBE/SDD
converged: YES YES NO NO
title: Mulliken charges:
elementType: S S S O O O O O O O O C C C C C C C C C C C C H H H H H H H H H H
charge: 0.872419 0.996239 0.997905 -0.504955 -0.518788 -0.560980 -0.564833 -0.488898 -0.491640 -0.484649 -0.490726 -0.028712 -0.025629 -0.255469 -0.257140 -0.024877 -0.022950 -0.230165 -0.232744 -0.220360 -0.225529 -0.180753 -0.180689 0.324471 0.325674 0.291525 0.291773 0.293961 0.295643 0.259591 0.259687 0.390636 0.390961
chargesum: 0.00000
title: Mulliken charges with hydrogens summed into heavy atoms:
elementType: S S S O O O O O O O O C C C C C C C C C C C C
charge: 0.872419 0.996239 0.997905 -0.504955 -0.518788 -0.170343 -0.173873 -0.488898 -0.491640 -0.484649 -0.490726 -0.028712 -0.025629 0.069002 0.068535 -0.024877 -0.022950 0.061360 0.059029 0.073600 0.070114 0.078839 0.078998
polarizability: 2.71867529e+02 -1.78508898e+00 2.45213635e+02 -1.40893008e-02 -2.26638014e+01 1.82564670e+02
1716.lowfreq: -7.8690 -1.9762 0.0010 0.0014 0.0015 4.1107 14.3961 15.2605 22.5252
frequency: 13.9556 15.0767 22.4543 27.1805 46.4056 78.9066 81.7897 99.4147 104.9499 144.2989 153.9269 163.1535 178.7929 182.5881 192.8320 194.4786 225.6836 232.8342 237.1041 252.5705 256.3121 265.5029 279.5611 297.4097 327.5841 329.5903 338.6946 381.5141 384.8899 414.8411 422.2249 425.7507 433.8585 449.1508 466.3708 532.1661 535.1184 572.1535 578.9311 627.7798 631.6738 679.7142 684.8931 691.8348 700.6971 789.2406 813.7720 817.2637 836.7487 837.3034 919.0587 927.2371 935.8799 949.5133 952.9020 965.9426 969.7821 970.4206 971.9137 1004.7079 1006.4895 1041.1650 1042.6987 1049.6333 1053.2140 1059.6008 1063.4246 1088.4485 1094.7235 1170.8836 1173.8905 1264.9732 1269.3238 1387.9673 1390.3143 1407.3067 1410.9087 1435.3225 1438.2995 1571.6670 1574.2052 1594.3049 1597.2146 3147.9163 3150.4059 3151.4390 3152.7630 3160.3394 3161.3439 3178.1375 3178.6672 3479.2175 3481.0279
redmass: 11.6696 7.3080 9.7777 8.2877 5.7692 12.4021 9.9410 6.0074 6.3559 8.4135 6.3737 5.4658 3.3832 2.6080 2.3140 3.6851 6.1020 6.0792 4.6957 7.1209 6.9807 3.8027 2.9859 5.2846 10.1499 9.7929 12.4183 6.7074 9.3321 7.6758 4.0985 9.5466 8.7347 3.5884 6.5123 9.6259 9.9606 8.6317 8.1898 7.1870 7.4021 2.8125 2.6159 6.7112 6.4554 12.7161 1.3600 1.3853 13.0120 12.6890 1.4561 1.7191 4.4874 1.3840 1.4161 7.0756 7.9275 12.1508 8.3530 1.3756 1.3739 3.9920 3.0813 1.4483 1.5868 1.4874 1.5874 1.5605 1.5757 1.0913 1.0916 1.2791 1.2717 8.2407 8.0343 2.6145 2.6134 2.1617 2.1726 6.5764 6.5031 7.6578 7.6656 1.0931 1.0928 1.0887 1.0887 1.0922 1.0923 1.0995 1.0995 1.0662 1.0662
irintensity: 0.4619 1.2657 0.9686 1.8540 1.6745 3.8607 0.9560 0.5838 0.6703 2.5645 6.9433 12.7604 27.1474 28.0408 24.2570 24.0332 6.5522 2.6640 1.4846 11.3975 18.1961 30.7448 66.2196 68.3763 8.0986 8.3131 4.3696 6.7815 17.4289 45.0790 32.4446 37.4389 60.6974 11.9529 78.0676 192.7811 124.1708 26.9298 29.2058 3.8064 5.6527 10.7069 40.1033 10.7286 49.8361 103.9178 26.7346 37.4473 60.6402 69.8169 5.5821 27.0673 50.8219 1.6216 1.7078 13.2450 44.7708 84.1119 47.5216 0.2505 0.8386 12.5439 12.7421 44.6406 22.4581 70.7447 41.0349 4.9996 19.0491 9.9104 2.0475 7.8515 5.7932 7.0467 5.7315 15.6288 55.0884 21.2595 8.6997 12.4080 2.1687 1.8285 1.8437 5.9776 24.3031 0.0823 1.4162 10.9331 7.3717 2.1833 4.4696 59.9809 52.2758
temp: 298.150 k
press: 1.00000 atm
elementType: 16 16 16 8 8 8 8 8 8 8 8 6 6 6 6 6 6 6 6 6 6 6 6 1 1 1 1 1 1 1 1 1 1
symmnumber: 1
zpe: 535003.1 jmol-1
zpe.correction: 0.203772 hartree
zpe.thermalcorrener: 0.228278 hartree
zpe.thermalcorrenthalpy: 0.229222 hartree
zpe.thermalcorrgfe: 0.146175 hartree
zpe.sumelectzpe: -2257.027547 hartree
zpe.sumelectthermal: -2257.003041 hartree
zpe.sumelectthermalent: -2257.002097 hartree
zpe.sumelectthermalfe: -2257.085144 hartree
dipole: 1.6767 3.1552 -6.0362
dipole: 7.0145
quadrupole: -158.8009 -159.8889 -163.9559
quadrupole: -3.6995 11.7833 -19.2692
quadrupole: 2.0810 0.9930 -3.0740 -3.6995 11.7833 -19.2692
hfenergy: -2257.2313187 hartree
pointgroup: C01 [X(C12H10O8S3)]
dipole: 0.6827328 -1.3157585 2.3277987 debye
polarizability: 271.8728341|1.2801712|246.4621086|-1.4059109|-20.8077985|181.3108909 unknown
InChI: InChI=1S/C12H10O8S3/c13-21(14,9-3-1-5-11(7-9)22(15,16)17)10-4-2-6-12(8-10)23(18,19)20/h1-8,15,18H
charge 0 multiplicity 1
33 atoms
S  -0.028502 -1.960089 -1.234618
S  3.915736 1.909448 -0.025836
S  -3.985761 1.920398 -0.093922
O  -0.016287 -1.093393 -2.617524
O  -0.033149 -3.594308 -1.163707
O  5.068945 1.343924 -1.360637
O  -2.883705 2.813858 1.100283
O  2.816346 2.907907 -0.66422
O  4.777767 2.338799 1.272409
O  -3.642695 2.421854 -1.591499
O  -5.501728 1.929675 0.466041
C  1.480748 -1.390051 -0.219182
C  -1.546389 -1.380441 -0.237818
C  2.021732 -0.127105 -0.501622
C  -2.070125 -0.109939 -0.51903
C  3.153958 0.212733 0.254258
C  -3.207929 0.237009 0.225374
C  2.026595 -2.291999 0.70781
C  -2.110285 -2.280759 0.680273
C  3.7443 -0.619916 1.218525
C  -3.821353 -0.596834 1.173691
C  3.169869 -1.893479 1.439268
C  -3.263624 -1.878166 1.393196
H  1.599064 0.535862 -1.265207
H  -1.645812 0.542516 -1.290911
H  1.58067 -3.284808 0.831154
H  -1.675889 -3.278665 0.803651
H  4.621595 -0.280461 1.778372
H  -4.7186 -0.26145 1.70383
H  3.616924 -2.572863 2.170849
H  -3.729373 -2.558932 2.111724
H  5.539618 2.148643 -1.727313
H  -3.046361 3.796931 0.997738
