program: Gaussian 09
title: 000162899
version: EM64L-G09RevD.01
frameworkgroup: C1[X(C7H9N3O2)]
method: RPBEPBE
basis: SDD
operation: Freq
keyword: #pfreq=noraman
keyword: PBEPBE/SDD
title: #p freq=noraman PBEPBE/SDD
converged: YES YES NO YES
title: Mulliken charges:
elementType: O O N N N C C C C C C C H H H H H H H H H
charge: -0.411377 -0.232095 -0.310921 -0.405152 -0.076920 -0.182636 -0.465064 0.014966 -0.490642 0.210325 0.154063 -0.258625 0.272783 0.245836 0.233916 0.228840 0.236079 0.293170 0.303164 0.258843 0.381447
chargesum: 0.00000
title: Mulliken charges with hydrogens summed into heavy atoms:
elementType: O O N N N C C C C C C C
charge: -0.029929 -0.232095 -0.017751 -0.101988 -0.076920 0.090147 0.014688 0.014966 -0.025723 0.210325 0.154063 0.000218
polarizability: 1.24275031e+02 2.02246477e+00 9.50122860e+01 -2.83242798e+00 7.04538005e-01 6.46903405e+01
1716.lowfreq: -12.3569 -6.6938 -0.0006 -0.0002 0.0005 7.4344 43.6415 63.5738 129.2183
frequency: 43.6255 63.5727 129.2176 151.1572 212.8715 264.2913 295.7443 319.7094 387.5615 473.0390 498.0349 581.8849 598.2226 605.7073 618.6270 644.0560 668.9401 690.9182 717.6766 752.4270 767.0798 845.6817 922.7518 929.2307 958.0511 986.6186 1039.7746 1075.6027 1084.9635 1111.6946 1140.6146 1172.0300 1212.0818 1223.0204 1231.3748 1259.2543 1286.9824 1312.0142 1328.8565 1352.0663 1355.4001 1397.7845 1454.6135 1459.9141 1462.4804 1464.7611 1590.6151 1662.9289 2946.2256 2979.0903 3020.5411 3029.6295 3056.5159 3237.5220 3473.8186 3507.3444 3584.6240
redmass: 8.2024 4.0128 3.7423 5.6960 3.1427 2.6634 6.0815 3.4750 4.5639 5.5743 3.5008 1.3717 4.3441 1.7996 1.7933 1.3146 3.6626 4.1774 5.0507 4.5534 1.4049 2.2952 7.0037 2.5513 2.6781 3.3168 2.1363 1.8390 2.0871 3.3595 2.8727 1.3094 1.5470 1.9237 1.7431 1.5040 1.7180 1.2381 2.4390 1.8065 1.8443 5.3772 1.1637 2.8761 1.0904 1.2360 5.9066 8.6296 1.0671 1.0640 1.0944 1.0849 1.0975 1.0984 1.0755 1.0639 1.0818
irintensity: 2.3463 1.2963 10.0369 1.5217 2.6220 18.9037 1.7692 6.3280 0.5856 15.5757 15.3516 62.5035 26.3799 91.6892 161.6830 53.0237 38.0277 34.8433 22.2295 5.8213 26.4879 2.0458 1.5206 2.1015 31.9695 3.3682 163.2478 48.7642 72.0981 9.6015 22.7055 9.7740 1.3916 15.5385 0.8127 1.4707 4.6304 13.0701 29.9718 39.5474 38.1126 12.3786 14.3824 4.6439 6.2309 3.4538 15.4200 224.7347 64.4775 24.9003 24.4454 10.4498 19.0137 2.0335 9.4725 24.0871 35.4163
temp: 298.150 k
press: 1.00000 atm
elementType: 8 8 7 7 7 6 6 6 6 6 6 6 1 1 1 1 1 1 1 1 1
symmnumber: 1
zpe: 428507.4 jmol-1
zpe.correction: 0.163210 hartree
zpe.thermalcorrener: 0.173487 hartree
zpe.thermalcorrenthalpy: 0.174431 hartree
zpe.thermalcorrgfe: 0.126577 hartree
zpe.sumelectzpe: -585.947007 hartree
zpe.sumelectthermal: -585.936730 hartree
zpe.sumelectthermalent: -585.935786 hartree
zpe.sumelectthermalfe: -585.983640 hartree
dipole: 2.1410 2.3027 -1.0273
dipole: 3.3078
quadrupole: -55.5396 -72.3076 -72.7455
quadrupole: 17.2658 1.1197 -0.1225
quadrupole: 11.3246 -5.4434 -5.8813 17.2658 1.1197 -0.1225
hfenergy: -586.1102169 hartree
pointgroup: C01 [X(C7H9N3O2)]
dipole: 0.7942068 -0.9472758 0.4068762 debye
dipolederiv: -0.5983807 0.2867039 0.3625251 0.3124389 -0.7341955 -0.3464628 0.3277569 -0.2928129 -0.6325904 -0.7542998 -0.0778389 -0.2433132 0.1032811 -0.5059682 -0.1982643 -0.1299032 -0.3151318 -0.7144521 -0.6427353 -0.1086401 0.0034963 -0.1440772 -0.6622737 0.0629154 0.0917318 0.0911754 -0.2086919 -0.350583 0.1995311 -0.0365615 0.1645443 -0.4081712 0.0383062 -0.0382219 0.0484611 -0.2325339 -0.4085324 0.1168746 -0.017365 0.0542216 -0.4170063 0.028569 0.0023117 0.0298974 -0.2533463 -0.089383 0.0298494 -0.116433 -0.0459113 0.479571 -0.0441318 -0.2131271 0.0526126 0.2111301 -0.0449405 -0.0877083 0.031472 0.1478765 -0.0465802 0.0448186 -0.0592564 0.0542941 0.1536618 0.349783 -0.0226859 0.0142825 -0.2132468 -0.0031996 -0.015511 0.1187084 -0.0196517 -0.0891816 0.5102702 0.083685 0.024905 -0.0114757 0.3311172 -0.0700152 0.121288 -0.0812624 0.3565 0.0669552 -0.2265826 0.0504 -0.0096604 0.0156761 -0.027212 -0.0213649 -0.0414089 -0.087193 1.3131432 -0.2362091 0.0636026 -0.4181564 0.7602985 0.5907855 0.0510183 0.6335467 0.9886558 -0.0420037 -0.1127446 0.0205327 -0.1308608 0.4619701 -0.0946301 0.0115963 -0.1044125 -0.1034587 0.0907642 -0.0089419 -0.0220263 0.0123877 0.0165536 0.0032077 0.0161337 -0.0211784 -0.0999278 0.0414698 0.012413 0.0168484 0.0490691 -0.0793305 -0.0571449 0.0362327 -0.0875339 0.0489293 -0.0203342 0.0448974 -0.0665677 0.0103825 0.0691036 0.0125949 -0.0778194 0.0672194 -0.0931436 -0.0032579 0.0276852 0.0278273 0.0151426 -0.1040627 -0.0668552 0.0258632 -0.1422258 0.0332613 -0.0169197 -0.030274 -0.0050912 -0.0359926 0.0015538 0.0635227 -0.0484679 0.1474706 -0.1387204 0.2651751 0.0938606 0.0099507 0.1343725 0.2311326 0.0551691 -0.0380242 -0.0541821 0.0501541 0.2087165 0.0009992 -0.0047447 0.0122375 0.1409831 0.0333984 -0.0059714 0.0334196 0.3367256 -0.0454621 -0.0085423 -0.0042473 -0.0084942 0.0966894 0.0160508 -0.0031776 0.0156125 0.1957609 0.1705551 0.0236682 -0.1094927 0.0019209 0.356139 -0.029111 -0.1673069 -0.013909 0.2784605 unknown
polarizability: 123.9811918|-3.5001609|95.2957175|2.9870637|0.5161766|64.7007481 unknown
InChI: InChI=1S/C7H9N3O2/c11-7(12)5-1-4-6(2-8-5)10-3-9-4/h3,5,8,10-11H,1-2H2
charge 0 multiplicity 1
21 atoms
O  -3.244831 1.178993 0.812749
O  -3.234642 -0.25081 -1.019108
N  -0.857314 -1.402481 -0.055603
N  2.894624 -0.70676 0.133955
N  2.285024 1.443087 -0.247017
C  -1.204698 -0.030782 0.369715
C  -0.286337 1.099427 -0.242265
C  1.139759 0.632059 -0.139234
C  0.516769 -1.836742 0.284306
C  1.493484 -0.699039 0.086495
C  -2.6453 0.241434 -0.03197
C  3.325985 0.605067 -0.076914
H  -1.123787 0.031117 1.470264
H  -0.434576 2.046474 0.307111
H  -0.563976 1.283197 -1.299564
H  0.763813 -2.713747 -0.344093
H  0.539764 -2.186431 1.33805
H  -1.123879 -1.574119 -1.032978
H  3.490751 -1.518644 0.29021
H  4.375823 0.887741 -0.098867
H  -4.165056 1.37836 0.487658
