program: Gaussian 09
title: 000162955
version: EM64L-G09RevD.01
frameworkgroup: C1[X(C21H30O4S)]
method: RPBEPBE
basis: SDD
operation: Freq
keyword: #p
keyword: freq=noraman
keyword: PBEPBE/SDD
title: #p freq=noraman PBEPBE/SDD
converged: YES YES NO NO
title: Mulliken charges:
elementType: S O O O O C C C C C C C C C C C C C C C C C C C C C H H H H H H H H H H H H H H H H H H H H H H H H H H H H H H
charge: -0.026856 -0.460606 -0.465026 -0.206835 -0.238336 0.399593 -0.113159 -0.197495 -0.154810 0.136140 -0.659687 0.239958 -0.144119 -0.542737 -0.589009 -0.475239 -0.856354 0.536675 -0.637374 -0.499687 -0.795341 0.234180 -0.572152 -0.592273 0.178885 -0.833925 0.253811 0.257518 0.215034 0.256252 0.247798 0.220016 0.224315 0.249064 0.256514 0.212336 0.222381 0.213079 0.254372 0.268083 0.213864 0.227320 0.232593 0.210970 0.236144 0.209470 0.281960 0.215580 0.344495 0.243310 0.232802 0.346530 0.253357 0.299655 0.291248 0.145721
chargesum: 0.00000
title: Mulliken charges with hydrogens summed into heavy atoms:
elementType: S O O O O C C C C C C C C C C C C C C C C C C C C C
charge: 0.118864 -0.116111 -0.118496 -0.206835 -0.238336 0.399593 0.140652 0.060023 0.060224 0.136140 -0.155638 0.239958 0.075896 -0.069358 -0.120159 -0.039779 -0.120035 0.536675 -0.177461 -0.052574 -0.088330 0.234180 -0.096039 -0.338917 0.178885 -0.243022
polarizability: 3.32766153e+02 -8.36228177e-01 2.24098987e+02 -1.99012190e+01 -3.94866854e+00 1.88623800e+02
1716.lowfreq: -16.5860 -7.3309 0.0005 0.0006 0.0013 7.1213 22.5977 26.7351 45.2459
frequency: 22.5191 26.6317 45.1174 49.9600 70.5328 73.3991 120.6400 126.8652 144.2601 160.2181 171.5684 178.9725 181.2966 187.2942 204.5086 224.5297 234.7435 243.3234 250.8984 256.1244 258.5770 268.9519 275.9995 291.7223 300.8215 316.0838 327.4582 352.4012 363.5761 370.9665 374.3365 391.6061 413.5541 426.7322 447.7389 468.3183 489.9456 509.2721 516.9712 528.2898 555.2963 555.9703 577.4029 614.1861 638.4074 655.5028 678.8182 694.1165 713.7254 739.6735 754.3620 775.2246 780.3864 792.4110 827.4166 847.0873 850.0642 852.0689 876.0793 883.4623 909.7160 915.2730 924.4878 929.0583 931.6691 947.1379 955.9227 961.2365 975.9480 985.3028 1013.6702 1023.7629 1025.9384 1030.9841 1036.3866 1048.4972 1064.9334 1080.0369 1092.4714 1109.5586 1113.7312 1121.2083 1124.1518 1129.6147 1136.4940 1156.6853 1166.3358 1175.2731 1185.9287 1187.2577 1198.4709 1211.0603 1217.9870 1226.4744 1241.3163 1250.1327 1257.9406 1268.9937 1273.9525 1278.5281 1281.5227 1287.1046 1298.1389 1299.1599 1310.5545 1321.4336 1325.2817 1331.5193 1337.6428 1343.7373 1346.1296 1352.5191 1358.9241 1373.3138 1380.5789 1392.8843 1396.8512 1419.9906 1443.6954 1457.1640 1460.0462 1466.4189 1467.0309 1468.0851 1470.6878 1477.0861 1485.4818 1496.6036 1503.6126 1584.3747 1616.1664 1624.6891 2378.3382 2916.4914 2946.8479 2954.0639 2958.2770 2961.2078 2968.1460 2979.7140 2981.8913 2983.3382 2991.1025 2994.8659 2997.9558 3005.2972 3016.3660 3029.3977 3038.6774 3042.7708 3044.6348 3045.5683 3063.0411 3069.5421 3074.6577 3085.5364 3087.7396 3111.1252 3115.7888 3122.2165 3554.7557 3563.5370
redmass: 7.2270 5.4173 6.0187 4.0739 4.1910 5.4673 2.2293 3.4041 4.7710 3.2303 2.0668 2.6432 1.7733 2.4490 2.2918 2.4429 1.7277 2.1708 2.2570 3.4195 2.8190 3.4178 1.4954 2.5171 2.6827 2.2405 1.3854 3.9842 2.6191 3.2515 2.7578 2.7695 3.4506 3.6881 3.0478 3.4744 3.0079 3.4651 3.4783 2.5313 2.8447 2.7341 3.2521 4.1315 3.3225 4.3478 5.3993 3.6179 2.8091 3.3793 3.4510 2.3245 1.9036 2.4291 2.2460 2.6854 2.4851 1.8516 2.2023 1.5131 2.0702 2.0294 1.7216 1.8160 2.4306 2.0333 1.9808 2.8246 2.5226 2.2841 2.1721 2.0762 2.4814 1.8664 2.0532 2.1206 2.2596 2.3259 1.6399 2.5861 1.8339 1.8195 1.5914 1.4179 1.4013 2.2363 1.8836 1.6613 1.5643 1.8583 1.8665 1.3732 1.8393 1.3370 1.7033 1.4551 1.4825 1.6154 1.5425 1.9780 1.3813 1.4659 1.4498 1.5747 1.5581 1.4129 1.4323 1.4125 1.4798 1.9856 1.4608 1.4002 1.3498 1.4530 1.4686 1.2367 1.1921 1.0851 1.0786 1.0811 1.0714 1.0803 1.0878 1.0842 1.0683 1.0701 1.0827 1.0554 1.0597 9.9619 9.5728 7.7981 1.0365 1.0803 1.0805 1.0802 1.0663 1.0610 1.0659 1.0667 1.0636 1.0634 1.0411 1.0740 1.0444 1.0632 1.0587 1.0967 1.0975 1.0974 1.0970 1.0972 1.0960 1.1031 1.0979 1.1013 1.0960 1.0996 1.0911 1.0978 1.0658 1.0666
irintensity: 5.3600 1.6568 0.8100 0.6577 1.7438 2.8803 0.8600 3.8613 0.3872 7.7737 2.5266 19.7383 85.0242 15.1457 1.7272 11.5838 18.0947 5.1527 3.3242 5.6397 8.7685 2.7805 32.4854 7.9584 3.1326 33.7210 126.2652 5.8548 0.6575 4.5480 1.0376 2.1053 1.7855 4.0843 3.6606 3.0735 6.1545 3.0501 6.3242 0.3713 4.1834 1.1853 3.1931 4.5266 4.3536 1.6810 6.8176 23.1851 16.2195 5.5215 0.6816 4.0910 5.7201 5.6312 2.3839 2.6272 19.3496 22.9698 4.0574 25.9916 1.6290 37.7616 14.3997 17.0748 58.6046 7.7918 23.7378 3.0412 2.0901 34.1108 0.1137 9.4861 7.1768 4.1796 7.2441 8.7776 44.4646 0.8701 15.7325 3.2346 13.7523 11.2024 2.1917 12.2147 5.0043 6.0875 7.3534 2.7161 19.2774 20.3179 15.8306 5.5542 3.1835 19.4045 24.8355 18.4985 18.2942 11.1697 26.6406 27.1306 4.2730 10.1818 4.1377 16.0275 28.7966 2.2217 6.8255 3.9853 10.3081 5.0616 4.0248 4.4760 3.3989 1.6361 1.0169 22.2503 36.0035 24.6961 22.1948 17.4279 9.1042 4.3189 6.1849 17.8150 3.3572 12.8236 2.9535 5.7938 14.3586 172.4286 54.7029 199.1618 23.7226 8.6516 9.3286 37.9926 18.1597 25.2413 30.3480 47.4151 16.5180 48.1243 22.2880 21.8419 25.2877 23.4395 21.0937 56.8076 29.7336 5.8305 7.4164 31.4267 25.1114 40.2080 39.4632 2.0520 21.0516 8.6234 11.6524 4.3417 4.1525 11.2800
temp: 298.150 k
press: 1.00000 atm
elementType: 16 8 8 8 8 6 6 6 6 6 6 6 6 6 6 6 6 6 6 6 6 6 6 6 6 6 1 1 1 1 1 1 1 1 1 1 1 1 1 1 1 1 1 1 1 1 1 1 1 1 1 1 1 1 1 1
symmnumber: 1
zpe: 1229002.9 jmol-1
zpe.correction: 0.468102 hartree
zpe.thermalcorrener: 0.494218 hartree
zpe.thermalcorrenthalpy: 0.495162 hartree
zpe.thermalcorrgfe: 0.413211 hartree
zpe.sumelectzpe: -1515.154159 hartree
zpe.sumelectthermal: -1515.128044 hartree
zpe.sumelectthermalent: -1515.127099 hartree
zpe.sumelectthermalfe: -1515.209051 hartree
dipole: -4.2091 3.2316 1.1916
dipole: 5.4387
quadrupole: -232.7805 -150.9791 -167.7837
quadrupole: -10.1555 18.1314 -1.6614
quadrupole: -48.9327 32.8687 16.0641 -10.1555 18.1314 -1.6614
hfenergy: -1515.6222619 hartree
pointgroup: C01 [X(C21H30O4S1)]
dipole: 1.6676775 -1.2447748 0.4978715 debye
polarizability: 332.4897086|0.7184808|224.2051327|20.8380972|3.6919888|188.7940993 unknown
InChI: InChI=1S/C21H30O4S/c1-19-7-5-13(22)9-12(19)3-4-14-15-6-8-21(25,17(24)11-26)20(15,2)10-16(23)18(14)19/h9,14-16,18,23,25-26H,3-8,10-11H2,1-2H3
charge 0 multiplicity 1
56 atoms
S  7.321522 0.832536 -0.226874
O  3.029405 -0.482045 -1.820221
O  -0.322023 2.173629 1.295336
O  4.432894 1.635771 0.284798
O  -6.41686 0.172431 -1.640584
C  1.88652 0.117861 0.294124
C  0.992802 -1.147887 0.10264
C  -0.438135 -0.989617 0.65379
C  -1.110425 0.235002 -0.046464
C  3.217181 -0.417911 -0.33609
C  1.228408 1.290481 -0.463593
C  -2.625689 0.455845 0.370505
C  -0.24543 1.529294 -0.041788
C  1.884007 -2.309623 0.616094
C  3.344672 -1.859552 0.261394
C  -1.259322 -2.269584 0.358774
C  2.119411 0.450793 1.796939
C  -3.376774 -0.863683 0.113997
C  -2.759854 -2.118115 0.703462
C  -3.218517 1.59531 -0.514601
C  -2.815176 0.805539 1.883268
C  4.475816 0.468662 -0.180946
C  -4.760405 1.61839 -0.55356
C  -4.576223 -0.920603 -0.550032
C  -5.329919 0.270186 -0.990982
C  5.779446 -0.116487 -0.743105
H  0.889427 -1.276482 -0.997295
H  -0.40551 -0.822963 1.748824
H  -1.155003 -0.039638 -1.127424
H  1.252298 1.065545 -1.546556
H  1.804992 2.226721 -0.319813
H  -0.68465 2.235839 -0.777894
H  1.626985 -3.274965 0.146833
H  1.772393 -2.435438 1.708834
H  3.987986 -1.855326 1.159693
H  3.829592 -2.544299 -0.463025
H  -0.84022 -3.126814 0.920178
H  -1.159094 -2.510267 -0.720441
H  2.69167 1.387638 1.893765
H  1.157142 0.581856 2.314926
H  2.689379 -0.339389 2.318573
H  -2.862522 -2.072359 1.808296
H  -3.323571 -3.009661 0.372545
H  -2.849749 1.46732 -1.553514
H  -2.842061 2.568699 -0.150616
H  -2.363154 0.044688 2.543099
H  -2.333493 1.767487 2.110211
H  -3.891639 0.860165 2.12922
H  3.401602 -1.335328 -2.158682
H  -5.137706 2.401681 -1.23443
H  -5.170552 1.845763 0.451713
H  0.394703 2.855891 1.344864
H  -5.065058 -1.886729 -0.733961
H  5.706477 -0.100256 -1.845755
H  5.906736 -1.162463 -0.419089
H  6.599765 1.976763 0.10394
