program: Gaussian 09
title: 000162885
version: EM64L-G09RevD.01
frameworkgroup: C1[X(C5H7NOS2)]
method: RPBEPBE
basis: SDD
operation: Freq
keyword: #p
keyword: freq=noraman
keyword: PBEPBE/SDD
title: #p freq=noraman PBEPBE/SDD
converged: YES YES NO NO
title: Mulliken charges:
elementType: S S O N C C C C C H H H H H H H
charge: 0.227542 0.091003 -0.143708 0.010187 -0.254748 -0.667205 -0.350814 -0.665803 -0.082424 0.241204 0.240916 0.217152 0.240525 0.240668 0.328138 0.327367
chargesum: 0.00000
title: Mulliken charges with hydrogens summed into heavy atoms:
elementType: S S O N C C C C C
charge: 0.227542 0.091003 -0.143708 0.010187 0.227372 0.031139 -0.350814 -0.010298 -0.082424
polarizability: 1.35508233e+02 -3.79426537e+00 1.13815533e+02 -5.75890466e-02 6.15949840e-02 5.04702626e+01
1716.lowfreq: -7.7171 -6.2498 0.0004 0.0012 0.0030 6.1008 28.0550 59.6345 85.5870
frequency: 27.8634 59.6171 85.5796 87.5568 121.1882 163.5658 206.4501 236.5657 275.8853 355.4252 365.9137 430.4845 457.8498 503.3596 537.0557 703.2549 802.6264 816.1602 880.9684 947.3186 959.4603 1004.1073 1117.7285 1117.9070 1149.6624 1188.1447 1248.2188 1255.9640 1358.1487 1402.7757 1408.5732 1460.1754 1466.4116 1483.0473 2204.4158 2992.2729 3003.0868 3035.6572 3060.5603 3099.7855 3106.3999 3117.0510
redmass: 6.5984 2.7120 5.5961 2.3837 4.0835 5.5003 9.8758 1.2067 4.6159 7.6764 3.5241 9.0129 10.1536 12.3876 7.8197 7.9869 4.4451 1.0929 1.5447 5.1290 8.8491 2.1103 1.9115 1.6419 1.0783 6.3305 1.2473 1.1590 1.3644 1.2413 1.0843 1.0386 1.0787 1.0566 12.4108 1.0547 1.0374 1.0565 1.1086 1.0985 1.1064 1.1024
irintensity: 5.5259 6.6132 5.5487 7.8994 0.3143 2.3063 0.8360 0.7845 0.5254 3.6213 0.7425 19.5807 0.3261 0.0133 27.1082 6.7286 25.1966 5.5876 1.6245 27.7100 240.0141 48.7368 24.5838 16.8697 0.3465 465.5740 5.9700 0.0989 3.9268 17.3544 20.5944 13.6021 12.7456 12.4951 3.9280 16.7054 14.7931 3.8789 10.9032 18.0815 0.1585 26.9130
temp: 298.150 k
press: 1.00000 atm
elementType: 16 16 8 7 6 6 6 6 6 1 1 1 1 1 1 1
symmnumber: 1
zpe: 294904.9 jmol-1
zpe.correction: 0.112323 hartree
zpe.thermalcorrener: 0.123451 hartree
zpe.thermalcorrenthalpy: 0.124395 hartree
zpe.thermalcorrgfe: 0.073276 hartree
zpe.sumelectzpe: -1120.096860 hartree
zpe.sumelectthermal: -1120.085732 hartree
zpe.sumelectthermalent: -1120.084788 hartree
zpe.sumelectthermalfe: -1120.135907 hartree
dipole: -3.5381 -1.4957 0.0770
dipole: 3.8420
quadrupole: -76.6856 -73.5070 -67.0759
quadrupole: 17.2210 0.2521 -0.0194
quadrupole: -4.2628 -1.0841 5.3469 17.2210 0.2521 -0.0194
hfenergy: -1120.2091831 hartree
pointgroup: C01 [X(C5H7N1O1S2)]
dipole: -1.273115 0.768714 -0.2702872 debye
dipolederiv: -0.6545722 -0.3072027 0.1825326 -0.5151929 -0.2744553 0.1534423 0.2724504 0.1391005 -0.0910808 -0.3694038 0.0764574 -0.0140201 -0.0696484 -0.7883622 0.2927058 0.047543 0.2808053 -0.2497487 -1.4238423 0.7929493 -0.2498649 0.6064927 -0.9176482 0.2590061 -0.1663296 0.2453772 -0.3035312 -0.2745492 0.0259547 -0.0031291 -0.0310032 -0.1869008 -0.007362 0.0155378 -0.0122304 -0.2105855 0.4069264 -0.1936591 0.0804771 -0.4485787 0.6582549 -0.0929516 0.1901211 -0.1120323 0.3975513 -0.0940128 0.0585328 -0.0148511 0.0741996 0.0041547 0.014651 -0.0209155 0.0156062 0.0458512 1.7326672 -0.4193761 0.0397946 0.2524553 1.3512675 -0.6393968 -0.2548638 -0.5894822 0.1897194 0.3909552 -0.0233057 -0.0086281 -0.1838455 0.1159074 0.0462147 0.0667425 0.0371622 0.1705374 0.101821 0.0401246 -0.0270755 0.1037546 -0.0417888 -0.0004671 -0.0487965 0.0043698 -0.0193808 -0.0031157 -0.065408 -0.0733337 0.0193241 -0.0595196 -0.0078374 -0.134997 -0.0176254 -0.0125136 0.0241775 0.0093865 0.0895889 0.1099298 -0.0282978 -0.0014964 0.071634 0.0218678 -0.070431 0.0572909 0.0305631 -0.0083398 0.0585316 -0.0984669 0.0911889 -0.0204669 0.0932454 0.0844633 0.0239956 -0.0329663 -0.052001 -0.1050306 0.0237103 -0.1018725 -0.0459138 -0.0910201 0.033518 0.0415843 0.0190108 0.0465673 -0.0332152 0.1262281 0.0065558 0.0938512 -0.01335 -0.0865661 0.0256847 -0.0034409 0.0086701 0.0908057 0.081467 0.0282061 -0.0244179 0.0094617 0.0384679 0.0143932 -0.0076203 0.0036126 0.0710211 0.0344496 -0.0405868 -0.0411792 -0.0112558 0.0837292 unknown
polarizability: 135.7809042|-2.2137178|103.5184055|-5.1793219|-22.5492161|60.4947196 unknown
InChI: InChI=1S/C5H7NOS2/c1-2-7-5(8)9-4-3-6/h2,4H2,1H3
charge 0 multiplicity 1
16 atoms
S  0.634092 0.6172 0.018649
S  -0.675936 -1.97041 1.240537
O  -2.01974 0.173057 0.419112
N  4.376966 0.511211 -0.17079
C  -2.155217 1.555002 -0.167796
C  -3.647207 1.859911 -0.191733
C  -0.801038 -0.42915 0.584041
C  2.038484 -0.596589 0.42387
C  3.320221 0.022032 0.088631
H  -1.593005 2.258203 0.475115
H  -1.712922 1.543387 -1.18183
H  -3.81106 2.867788 -0.614136
H  -4.187747 1.12838 -0.814816
H  -4.069867 1.835516 0.826286
H  1.970481 -0.842745 1.496419
H  1.865695 -1.518094 -0.155959
