program: Gaussian 09
title: 000013306
version: EM64L-G09RevD.01
frameworkgroup: C1[X(C16H24N2O3)]
method: RPBEPBE
basis: SDD
operation: Freq
keyword: #p
keyword: freq=noraman
keyword: PBEPBE/SDD
title: #p freq=noraman PBEPBE/SDD
converged: YES YES NO NO
title: Mulliken charges:
elementType: O O O N N C C C C C C C C C C C C C C C C H H H H H H H H H H H H H H H H H H H H H H H H
charge: -0.215187 -0.213128 -0.238206 -0.252774 -0.381180 -0.048739 -0.324222 0.031116 -0.430700 -0.445449 -0.412237 -0.408492 -0.430125 -0.428414 -0.386835 0.179567 -0.399929 -0.398563 -0.392956 0.117131 0.202732 0.248789 0.276665 0.241565 0.210070 0.207728 0.195271 0.245637 0.204430 0.196401 0.195034 0.205159 0.246095 0.197244 0.203441 0.246030 0.202183 0.194767 0.202962 0.197026 0.197394 0.203396 0.201014 0.199279 0.359011
chargesum: 0.00000
title: Mulliken charges with hydrogens summed into heavy atoms:
elementType: O O O N N C C C C C C C C C C C C C C C C
charge: -0.215187 -0.213128 -0.238206 -0.252774 -0.022170 0.200049 -0.047557 0.272681 -0.012902 -0.004541 -0.011406 -0.008299 0.013214 0.021058 0.010114 0.179567 0.000059 0.002228 0.007336 0.117131 0.202732
polarizability: 2.29446288e+02 -4.32025171e+00 1.74160065e+02 1.02906593e+01 7.04703379e+00 1.60582968e+02
1716.lowfreq: -7.0427 0.0003 0.0004 0.0007 6.0730 13.8648 29.1412 34.9627 43.8572
frequency: 28.5892 34.9369 43.6772 61.0335 76.1259 92.7793 135.2834 158.2035 163.3433 177.1907 208.1810 214.9522 220.8144 226.4758 255.5583 323.6001 333.3076 358.7795 377.5116 405.9588 416.2710 431.9872 439.9692 444.9888 451.1673 473.0510 497.2964 514.5528 546.2755 603.9491 634.5099 680.6690 707.9254 738.7469 764.3510 776.3568 783.4826 790.5755 793.6781 819.8948 841.8654 850.7982 860.3262 891.9093 899.0470 901.9187 917.3202 923.7845 932.9988 956.8846 984.7059 1030.8849 1045.7869 1046.9182 1051.0999 1060.6810 1062.8395 1075.0126 1078.9784 1080.3875 1110.5752 1114.0094 1132.4524 1159.3282 1162.9956 1191.3094 1199.9781 1221.2912 1245.9582 1252.0402 1258.8920 1260.3576 1265.8888 1269.3849 1273.1136 1302.3768 1310.0320 1312.5897 1323.3384 1331.3046 1333.2878 1335.7022 1341.8629 1343.1656 1345.2405 1347.3093 1351.2509 1351.7598 1353.5382 1363.5361 1373.2646 1400.9337 1462.2077 1462.8390 1464.2134 1464.5884 1465.2940 1469.1947 1469.9701 1474.3795 1477.3245 1484.9843 1589.2996 1643.3501 1647.4573 2961.1751 2966.5186 2968.4943 2969.0868 2969.4203 2970.8066 2973.9334 2974.5881 2983.0245 2991.2102 2996.2234 3020.7779 3024.6048 3031.6518 3032.1393 3032.2035 3032.6986 3033.7291 3041.0069 3042.3523 3052.7625 3065.4271 3073.3234 3516.3579
redmass: 4.2350 4.5104 3.4007 4.2937 4.0927 3.5528 5.1897 6.8122 5.4367 3.6386 3.3611 1.9089 2.9479 2.3866 4.1392 1.8442 1.7878 6.8568 6.1657 7.3457 3.4072 3.1935 2.7564 3.5737 2.6966 1.9969 6.1067 2.3192 2.8701 7.3985 4.6297 3.5359 5.5998 2.9959 2.7642 1.8539 1.8998 1.4338 2.2101 3.5726 2.4997 1.7377 1.7130 2.1861 1.4356 1.6646 2.2250 1.6699 2.4432 2.6032 2.4434 3.2126 2.4630 2.6734 1.8707 1.3737 1.1559 1.5122 1.4571 2.3149 2.6601 2.4456 1.8012 1.5392 2.3826 3.1208 1.6438 1.5967 1.2993 1.3655 1.2796 1.2659 1.3699 1.3374 1.3293 1.7156 1.3323 1.3981 1.7516 1.5914 1.3472 1.3605 1.4554 1.4874 1.4727 1.4917 1.4155 1.6324 2.3315 1.5207 1.7637 1.5945 1.0894 1.0891 1.0878 1.0903 1.0902 1.0833 1.0851 1.0858 1.0963 1.0923 10.1442 5.4373 10.4988 1.0607 1.0633 1.0631 1.0632 1.0637 1.0635 1.0623 1.0811 1.0626 1.0630 1.0629 1.0996 1.0855 1.0976 1.0965 1.0983 1.0847 1.0948 1.1034 1.1034 1.1016 1.1008 1.0993 1.0767
irintensity: 0.3188 0.5516 0.0855 0.0145 0.0750 0.1059 4.9814 8.0772 0.4367 1.3809 0.4410 0.5265 3.0137 3.8693 6.4006 0.4755 0.3972 9.4606 6.6675 7.0340 4.1749 0.9684 2.2644 16.9930 0.7071 0.9062 17.2503 2.8355 29.3391 0.9955 11.5186 11.7309 0.0232 18.1878 1.1160 67.9521 22.8567 1.5925 4.3421 2.0393 6.5588 1.4465 2.5497 1.8217 10.3488 21.8017 0.2146 0.0785 3.3852 3.9852 19.0750 17.4181 3.9133 3.8676 3.1793 0.6772 1.3829 14.9657 8.0940 28.6104 0.0867 0.6425 9.3675 27.5165 6.9404 55.4274 0.2168 54.6892 26.2494 3.0474 0.5102 0.8125 16.4000 1.4575 1.8589 90.7457 1.3958 50.9418 211.9587 106.6533 0.3509 0.5696 0.1512 3.6372 3.5333 26.4697 10.6749 30.7191 115.6838 6.3103 6.2023 40.2535 5.2123 2.9780 5.2848 4.9314 10.5394 11.8711 17.6840 17.7480 2.0568 4.9159 334.9241 452.9537 88.1591 28.4599 27.0381 34.5379 32.6891 32.4142 32.3826 31.8826 13.7457 26.4752 49.9679 23.0226 54.2502 19.9901 28.0759 26.7541 95.9029 6.0978 48.7962 30.9707 43.0527 69.8402 1.4291 39.3307 64.2441
temp: 298.150 k
press: 1.00000 atm
elementType: 8 8 8 7 7 6 6 6 6 6 6 6 6 6 6 6 6 6 6 6 6 1 1 1 1 1 1 1 1 1 1 1 1 1 1 1 1 1 1 1 1 1 1 1 1
symmnumber: 1
zpe: 1010466.7 jmol-1
zpe.correction: 0.384866 hartree
zpe.thermalcorrener: 0.404226 hartree
zpe.thermalcorrenthalpy: 0.405171 hartree
zpe.thermalcorrgfe: 0.336547 hartree
zpe.sumelectzpe: -957.725044 hartree
zpe.sumelectthermal: -957.705684 hartree
zpe.sumelectthermalent: -957.704739 hartree
zpe.sumelectthermalfe: -957.773363 hartree
dipole: 0.3003 -1.8805 0.5259
dipole: 1.9756
quadrupole: -124.0856 -131.1576 -131.9623
quadrupole: 4.2312 -3.8345 -3.7387
quadrupole: 4.9829 -2.0891 -2.8938 4.2312 -3.8345 -3.7387
hfenergy: -958.10991 hartree
pointgroup: C01 [X(C16H24N2O3)]
dipole: 0.1426758 -0.7492127 0.1498802 debye
polarizability: 229.8288633|-3.2488188|172.7655039|9.2521936|8.3124028|161.5949535 unknown
InChI: InChI=1S/C16H24N2O3/c19-14-13(11-7-3-1-4-8-11)15(20)18(16(21)17-14)12-9-5-2-6-10-12/h11-13,17H,1-10H2
charge 0 multiplicity 1
45 atoms
O  0.658107 -0.523482 -1.803397
O  -2.6168 2.597395 -0.188853
O  1.403644 2.069133 2.035606
N  1.0618 0.68441 0.156437
N  -0.607697 2.243886 0.902149
C  -2.146923 -0.537715 -0.557081
C  -1.230206 0.705373 -0.923424
C  2.462749 0.137507 0.301203
C  -2.063697 -0.929674 0.940273
C  -3.616309 -0.316755 -0.992689
C  -2.919212 -2.187071 1.231109
C  -4.471556 -1.573347 -0.695484
C  2.470628 -1.398197 0.491516
C  3.381396 0.592821 -0.859239
C  -4.388411 -1.978461 0.795314
C  0.233253 0.25808 -0.909041
C  3.921575 -1.884959 0.731214
C  4.824686 0.087443 -0.614499
C  4.859596 -1.447492 -0.419453
C  -1.56114 1.919827 -0.076034
C  0.667496 1.674332 1.093661
H  -1.732539 -1.372053 -1.161237
H  -1.472152 0.957674 -1.972626
H  2.833995 0.601658 1.233535
H  -2.438192 -0.091546 1.563658
H  -1.012353 -1.115228 1.238054
H  -3.652902 -0.080687 -2.074682
H  -4.037057 0.558922 -0.463459
H  -2.867042 -2.433376 2.309065
H  -2.493818 -3.052998 0.682925
H  -4.11661 -2.417999 -1.321951
H  -5.523028 -1.381403 -0.983167
H  2.058675 -1.889942 -0.407343
H  1.828603 -1.669081 1.352443
H  3.369903 1.697684 -0.928556
H  2.999758 0.189385 -1.813916
H  -4.973984 -2.900691 0.974436
H  -4.844555 -1.181109 1.417622
H  3.927781 -2.986874 0.83429
H  4.300396 -1.471086 1.688817
H  5.243093 0.579676 0.287915
H  5.467343 0.381657 -1.46608
H  5.894812 -1.781273 -0.213533
H  4.54027 -1.942878 -1.359028
H  -0.831977 3.016311 1.538527
