program: Gaussian 09
title: 000162855
version: EM64L-G09RevD.01
frameworkgroup: C1[X(C19H21ClN2O5S2)]
method: RPBEPBE
basis: SDD
operation: Freq
keyword: #p
keyword: freq=noraman
keyword: PBEPBE/SDD
title: #p freq=noraman PBEPBE/SDD
converged: YES YES NO NO
title: Mulliken charges:
elementType: Cl S S O O O O O N N C C C C C C C C C C C C C C C C C C C H H H H H H H H H H H H H H H H H H H H H
charge: -0.044698 0.868545 1.007535 -0.605223 -0.540675 -0.537886 -0.523976 -0.531483 -0.212656 -0.049800 0.073207 -0.605463 -0.674302 -0.671308 -0.080945 -0.410797 0.421669 -0.254342 -0.231392 -0.571831 -0.340986 -0.349911 0.056384 0.371512 -0.358266 -0.353975 -0.224193 -0.216812 -0.106641 0.298736 0.328850 0.281829 0.251472 0.241848 0.248022 0.255802 0.268403 0.250171 0.251007 0.283699 0.284043 0.257943 0.258244 0.251577 0.282954 0.377101 0.240226 0.268970 0.257770 0.260047
chargesum: 0.00000
title: Mulliken charges with hydrogens summed into heavy atoms:
elementType: Cl S S O O O O O N N C C C C C C C C C C C C C C C C C C C
charge: -0.044698 0.868545 1.007535 -0.228123 -0.540675 -0.537886 -0.523976 -0.531483 -0.212656 -0.049800 0.073207 0.022124 0.100846 0.100919 -0.080945 0.090380 0.421669 0.029357 0.052651 -0.055645 -0.089409 -0.066957 0.056384 0.371512 -0.118040 -0.085006 0.033576 0.043235 -0.106641
polarizability: 6.96933423e+02 -2.37351089e+01 2.75346197e+02 3.61005529e+00 2.79472470e+01 2.40782390e+02
1716.lowfreq: -8.8112 -5.6639 -0.9536 0.0013 0.0016 0.0019 1.9141 10.5645 17.3509
frequency: -7.2168 10.5405 17.3106 30.9230 33.7851 37.9785 46.2369 65.7201 78.7221 89.1189 97.0011 111.1891 111.6613 129.8169 133.9371 142.4478 149.6275 157.2357 170.5387 175.6456 192.8038 199.9235 211.9223 214.6718 230.4780 250.0038 261.5062 270.9106 286.5998 297.9525 304.4321 335.0339 341.9420 355.5059 362.5336 387.7137 398.1278 406.7742 409.2419 415.3499 419.2481 449.7988 463.7008 474.4438 497.7396 515.3640 525.9401 541.9420 546.3227 563.6492 617.2332 624.2740 686.3869 705.8989 713.8853 715.3341 765.1481 785.5875 812.2754 819.5781 824.6945 836.1938 836.8852 842.9796 850.0601 850.1740 856.3324 912.7128 945.0610 948.2342 952.1019 955.1474 976.7834 979.1556 981.1695 987.2900 995.2313 996.2152 1005.5750 1007.3785 1016.7797 1032.4060 1043.1171 1049.9053 1070.7563 1073.5076 1084.7528 1096.3370 1114.4673 1129.1513 1156.8625 1184.5486 1187.3953 1200.7849 1230.5259 1258.8022 1276.9616 1294.5272 1296.6580 1297.3507 1313.5695 1325.0343 1363.7257 1387.5853 1390.8523 1398.1551 1402.8931 1409.0180 1412.5487 1426.4920 1435.4214 1455.0918 1460.6469 1461.0455 1481.6889 1483.6506 1487.6625 1500.6737 1539.0188 1571.7857 1577.8346 1599.5123 1603.9463 2962.1329 2974.3142 2991.3617 3010.9618 3042.5874 3057.7728 3061.2224 3068.4081 3075.0475 3106.0814 3117.6729 3143.7280 3149.9882 3152.8830 3156.6495 3158.4253 3169.4812 3172.4143 3177.0812 3193.0232 3502.7254
redmass: 4.3472 10.4502 5.0504 7.7551 7.3728 7.4822 4.2991 7.6654 5.1125 4.7919 5.4604 6.2881 9.5979 2.0025 1.8918 5.9614 2.5242 2.2119 1.7062 3.5580 4.6113 4.7590 4.3358 4.1196 1.4693 9.2906 2.9364 6.3213 8.0221 7.2642 6.2771 7.1492 5.4562 6.6088 4.8395 2.3103 2.9811 6.6552 2.9620 5.8944 3.0448 5.2962 5.7301 3.5922 4.6860 7.9647 4.2336 2.8239 6.3207 4.2339 7.1577 7.1689 6.7811 6.9981 3.4955 3.5171 3.9306 16.4220 1.3703 1.3463 6.1740 1.3325 8.6690 1.4621 1.4407 1.9624 7.7340 2.8777 3.2389 2.2838 1.3540 1.3435 4.6004 1.3916 1.3925 4.8312 4.2436 1.8759 3.6297 1.3395 1.2628 2.7129 1.6652 2.4667 1.3675 2.6673 4.7190 1.5607 1.3707 1.3892 1.1519 1.1372 1.1342 1.1848 1.1000 1.5373 2.9142 2.4527 1.3048 1.3178 2.2541 1.8292 4.8645 4.8591 1.1939 3.2330 1.2113 3.0096 1.1541 4.4637 1.0536 1.0620 1.0703 1.2209 2.2574 1.0578 1.2280 2.8178 7.1178 7.5899 7.8242 6.1007 6.0790 1.0423 1.0425 1.0577 1.0611 1.1075 1.0594 1.0875 1.1049 1.0902 1.1014 1.1016 1.0887 1.0881 1.0907 1.0885 1.1111 1.0963 1.0960 1.0977 1.0944 1.0665
irintensity: 0.5428 0.2058 0.6991 1.3199 0.2766 2.2302 0.4143 2.3116 2.7057 3.0803 6.3046 0.6287 17.6779 26.2949 1.1465 1.3229 18.6780 30.3944 6.1676 10.5793 11.2872 3.3527 25.4437 2.5948 13.6893 15.2881 31.1922 9.1841 32.8034 4.6736 4.7915 0.7028 25.6867 21.6344 36.2901 4.0851 14.7094 14.3388 0.7809 40.5423 0.3848 17.0435 13.5992 14.6207 66.7028 128.9204 125.2778 12.8858 44.4479 10.6507 0.6592 0.2768 57.5768 13.0543 4.4364 1.2840 36.6543 129.5148 37.8364 18.6139 62.3719 13.4671 78.2885 55.6434 22.7146 18.1322 9.1345 42.3581 34.7720 63.8716 0.1101 2.7627 21.5852 0.4725 1.6691 5.4295 33.2635 3.2069 12.7635 17.2196 58.7307 1.7943 0.0924 142.3270 8.4570 103.5283 195.4710 83.7034 5.4401 71.2676 1.6950 55.7547 7.6743 50.7159 0.0482 52.6812 83.4455 8.4566 0.2042 12.4047 91.8643 3.3768 39.3711 26.1582 50.6334 194.6911 62.9379 91.2058 2.6687 7.2929 4.3406 24.5323 4.7799 21.3491 221.2205 9.3945 92.6091 194.3175 31.1283 17.3174 5.9612 194.8875 522.5681 13.3601 11.2180 28.4853 29.2381 4.3615 3.6827 14.2396 19.6699 5.2028 8.7129 10.8117 9.8826 2.0990 1.3126 1.4786 1.0039 13.7208 6.8143 1.9974 1.7425 43.2256
temp: 298.150 k
press: 1.00000 atm
elementType: 17 16 16 8 8 8 8 8 7 7 6 6 6 6 6 6 6 6 6 6 6 6 6 6 6 6 6 6 6 1 1 1 1 1 1 1 1 1 1 1 1 1 1 1 1 1 1 1 1 1
symmnumber: 1
zpe: 961399.2 jmol-1
zpe.correction: 0.366178 hartree
zpe.thermalcorrener: 0.396573 hartree
zpe.thermalcorrenthalpy: 0.397517 hartree
zpe.thermalcorrgfe: 0.301559 hartree
zpe.sumelectzpe: -2475.952593 hartree
zpe.sumelectthermal: -2475.922197 hartree
zpe.sumelectthermalent: -2475.921253 hartree
zpe.sumelectthermalfe: -2476.017211 hartree
dipole: -7.6684 -4.3192 -4.3786
dipole: 9.8302
quadrupole: -229.2901 -203.8973 -190.6120
quadrupole: 6.1094 11.2947 20.7327
quadrupole: -21.3569 4.0358 17.3211 6.1094 11.2947 20.7327
hfenergy: -2476.3187705 hartree
pointgroup: C01 [X(C19H21Cl1N2O5S2)]
dipole: 3.0586939 -1.9377267 1.3590871 debye
polarizability: 696.0441425|29.9997848|285.3952278|6.2812062|-19.5824403|231.6226399 unknown
InChI: InChI=1S/C19H20ClN2O2S.HO3S/c1-14(2)13-25(23,24)18-9-7-17(8-10-18)22-12-11-19(21-22)15-3-5-16(20)6-4-15;1-4(2)3/h3-10H,11-13H2,1-2H3;1H
charge 0 multiplicity 1
50 atoms
Cl 9.308373 2.575315 -0.261862
S  -3.671486 -0.775528 -1.501357
S  -6.655521 1.591964 1.406758
O  -5.944974 0.331843 2.62643
O  -3.700418 0.173052 -2.838953
O  -4.333992 -2.274751 -1.51224
O  -8.266548 1.613245 1.598005
O  -5.838086 2.982691 1.567651
N  2.084949 -1.296705 0.302965
N  3.043606 -0.337664 -0.031007
C  -6.005868 0.504173 -0.343489
C  -4.56364 0.250095 -0.005339
C  -6.242751 1.527187 -1.446731
C  -6.918734 -0.711176 -0.332953
C  -1.89944 -0.916939 -0.918964
C  2.644609 -2.431657 1.099696
C  0.761221 -1.165523 -0.106784
C  -1.533929 -2.043881 -0.163059
C  -0.982561 0.082808 -1.300866
C  4.143648 -2.042663 1.230797
C  -0.194562 -2.167385 0.247315
C  0.35358 -0.041146 -0.891231
C  4.215585 -0.713843 0.469442
C  5.431831 0.08012 0.29317
C  6.669768 -0.368209 0.834984
C  5.407951 1.314623 -0.42217
C  7.851066 0.384715 0.670338
C  6.578786 2.074098 -0.592027
C  7.789086 1.597049 -0.042347
H  -3.941853 1.15771 0.04839
H  -4.410708 -0.420678 0.852004
H  -5.801303 1.128071 -2.383197
H  -5.737374 2.486127 -1.234935
H  -7.318424 1.709431 -1.605621
H  -7.974707 -0.417697 -0.452052
H  -6.806206 -1.300035 0.592088
H  -6.628876 -1.367362 -1.178753
H  2.135587 -2.499949 2.078385
H  2.498276 -3.385501 0.560786
H  -2.272267 -2.817573 0.072136
H  -1.305136 0.919437 -1.92949
H  4.810512 -2.798778 0.779648
H  4.450523 -1.916654 2.284314
H  0.104584 -3.04069 0.833636
H  1.09874 0.707055 -1.168125
H  -6.302569 0.562934 3.53053
H  6.720778 -1.310858 1.390218
H  4.460345 1.666563 -0.840596
H  8.799923 0.035921 1.087432
H  6.556906 3.020017 -1.14067
