program: Gaussian 09
title: 000013304
version: EM64L-G09RevD.01
frameworkgroup: C1[X(C18H19NS)]
method: RPBEPBE
basis: SDD
operation: Freq
keyword: #p
keyword: freq=noraman
keyword: PBEPBE/SDD
title: #p freq=noraman PBEPBE/SDD
converged: YES YES NO NO
title: Mulliken charges:
elementType: S N C C C C C C C C C C C C C C C C C C H H H H H H H H H H H H H H H H H H H
charge: 0.153679 -0.293103 0.150714 0.238693 0.375670 0.441312 -0.906838 -0.310841 -0.382363 -0.482470 -0.396738 -0.407652 -0.352768 -0.390495 -0.265281 -0.241511 -0.235707 -0.256019 -0.239446 -0.624096 0.291746 0.267975 0.246325 0.192308 0.257197 0.240836 0.183293 0.215829 0.235438 0.247881 0.240488 0.229691 0.228292 0.228493 0.230470 0.251372 0.189128 0.222455 0.226043
chargesum: 0.00000
title: Mulliken charges with hydrogens summed into heavy atoms:
elementType: S N C C C C C C C C C C C C C C C C C C
charge: 0.153679 -0.041731 0.150714 0.238693 0.375670 0.441312 -0.347117 -0.064516 -0.382363 -0.032965 -0.155902 -0.172214 0.046354 -0.142613 -0.024793 -0.011821 -0.007415 -0.027526 -0.008976 0.013530
polarizability: 2.56481574e+02 -9.68869754e+00 2.46682070e+02 -1.14117921e+01 -1.47753482e+01 1.56546357e+02
1716.lowfreq: -10.5661 -0.0017 -0.0016 0.0016 0.9165 6.9746 25.1169 34.1091 45.5867
frequency: 25.0389 33.9738 45.5793 69.7183 82.3874 95.5277 97.6080 127.8828 146.0594 178.6390 216.7057 232.6612 241.6804 254.5860 285.3363 309.3380 329.6446 370.1079 388.9750 430.9831 446.1867 450.0707 467.6584 483.1952 516.0462 572.4679 585.5938 625.6051 645.3136 648.4226 657.3238 663.8679 712.8260 728.4324 752.9358 769.3334 771.7795 794.5182 823.5775 860.3397 878.8133 882.8993 884.4224 910.2485 947.2055 952.3831 957.0196 978.5709 988.8631 995.6814 1026.3812 1034.0418 1037.9506 1059.7776 1079.3043 1096.6966 1118.8672 1123.3194 1135.3062 1154.2950 1162.7245 1165.6247 1173.7443 1175.6732 1210.4437 1219.1785 1244.7217 1250.8589 1273.0745 1274.2919 1284.8750 1290.2859 1351.8566 1357.8272 1363.3894 1374.3668 1413.6448 1435.6754 1435.9026 1444.5137 1447.3541 1459.5899 1464.0376 1467.1131 1480.9630 1486.5484 1496.7312 1564.5075 1581.8462 1592.9024 1608.8610 1639.7889 2836.7750 2868.4312 2943.7011 3000.1835 3012.3988 3035.0828 3065.1999 3075.0520 3086.9015 3107.3050 3121.3402 3123.4173 3129.8123 3132.6129 3143.8608 3146.7037 3163.0136 3165.3654 3445.4302
redmass: 4.1640 5.0143 4.5331 1.7806 4.0958 4.2076 3.0714 3.7124 4.0847 3.4330 3.1637 2.2797 1.6162 4.0382 3.7079 5.0577 3.9387 3.9455 3.7983 4.1600 3.4686 3.2228 3.4670 3.8759 4.2413 4.9064 4.1478 5.4251 5.4051 1.3609 4.5847 5.1701 5.2226 3.6450 1.3488 1.5426 2.5194 1.3553 3.0306 1.3311 1.7107 1.8353 1.4638 2.7233 1.4856 1.4755 1.9767 1.3268 1.3300 1.9247 5.8802 3.0593 2.3909 2.1962 2.0021 1.5484 1.7410 1.7681 1.8685 1.1346 2.2998 2.7148 1.0584 1.0888 1.6361 1.7379 1.3376 1.6737 1.1836 1.4191 1.4976 1.5470 3.3260 1.4715 2.1035 7.3237 2.0557 1.4488 1.3213 1.3651 1.2073 2.2114 1.1117 1.0820 2.8344 1.0694 1.0632 6.4343 6.7738 6.0870 6.4908 8.1246 1.0713 1.0568 1.0685 1.0857 1.0747 1.0583 1.0910 1.0993 1.0899 1.1067 1.0863 1.0860 1.0886 1.0881 1.0943 1.0939 1.1007 1.1011 1.0745
irintensity: 0.1344 0.4552 0.6937 2.2782 1.2657 0.2833 1.2940 2.6541 0.6386 1.1482 0.2736 0.3899 1.1504 1.7141 1.5589 1.2062 1.7612 0.4342 3.9128 5.2920 1.4233 9.1711 1.7971 7.1706 1.5471 2.2756 15.6787 9.6217 19.3409 96.7675 6.1949 8.5446 4.6335 9.4657 55.4429 51.4146 35.4615 2.7857 2.2902 1.8430 3.9573 5.2221 7.5535 2.1141 1.3477 1.8829 2.5324 0.1184 0.7530 22.7522 30.4656 9.7537 7.2673 2.2152 4.4630 8.3285 7.8036 9.1280 11.6822 3.7959 24.8999 14.1236 0.3691 0.6556 0.7039 4.5742 4.3443 4.3554 4.3537 3.7948 1.1448 3.2180 1.3491 18.7094 4.5550 0.1332 20.8770 1.2985 3.4224 12.4829 20.3371 38.3756 4.1977 8.4997 11.8073 15.5944 8.0675 9.1531 0.5006 11.2158 0.1883 2.1055 83.7868 184.1077 32.4875 40.5903 46.4310 18.4031 5.5511 41.9136 33.2066 3.8406 4.7099 2.1311 3.1304 2.6982 24.5889 23.1677 32.4394 29.2167 1.3107
temp: 298.150 k
press: 1.00000 atm
elementType: 16 7 6 6 6 6 6 6 6 6 6 6 6 6 6 6 6 6 6 6 1 1 1 1 1 1 1 1 1 1 1 1 1 1 1 1 1 1 1
symmnumber: 1
zpe: 837239.3 jmol-1
zpe.correction: 0.318888 hartree
zpe.thermalcorrener: 0.337474 hartree
zpe.thermalcorrenthalpy: 0.338418 hartree
zpe.thermalcorrgfe: 0.270731 hartree
zpe.sumelectzpe: -1148.665898 hartree
zpe.sumelectthermal: -1148.647312 hartree
zpe.sumelectthermalent: -1148.646368 hartree
zpe.sumelectthermalfe: -1148.714055 hartree
dipole: -2.0690 -0.7910 -0.3708
dipole: 2.2459
quadrupole: -122.2452 -114.5340 -122.6488
quadrupole: 4.0601 1.2360 -2.3820
quadrupole: -2.4359 5.2753 -2.8395 4.0601 1.2360 -2.3820
hfenergy: -1148.984786 hartree
pointgroup: C01 [X(C18H19N1S1)]
dipole: -0.715222 0.504854 0.1196728 debye
polarizability: 260.1446945|6.7466629|241.8816224|9.5166891|-18.8166096|157.6836841 unknown
InChI: InChI=1S/C18H19NS/c1-19-12-6-10-16-15-8-3-2-7-14(15)13-20-18-11-5-4-9-17(16)18/h2-5,7-11,19H,6,12-13H2,1H3
charge 0 multiplicity 1
39 atoms
S  2.781418 -1.569359 1.257923
N  -4.579103 1.844485 0.612553
C  0.093845 0.369378 0.281034
C  -0.336399 -1.000967 -0.16439
C  0.102015 -2.156856 0.542904
C  1.517671 0.784929 0.02302
C  0.983632 -1.967786 1.745683
C  -0.793001 1.26671 0.813613
C  2.68651 0.032808 0.353589
C  -2.266522 1.047822 1.071088
C  -1.164903 -1.161901 -1.302646
C  -0.291907 -3.442978 0.101642
C  -3.158893 2.014028 0.250743
C  1.712855 2.032069 -0.644872
C  3.973856 0.527964 0.01141
C  -1.558288 -2.447953 -1.735889
C  -1.119932 -3.593315 -1.03256
C  2.988777 2.527265 -0.97338
C  4.131899 1.762303 -0.645775
C  -5.513278 2.697353 -0.144013
H  0.637992 -1.15031 2.398259
H  1.092641 -2.888535 2.341436
H  -0.400846 2.251934 1.110022
H  -2.470676 1.22716 2.149987
H  -2.571259 0.010623 0.852299
H  -1.492879 -0.272096 -1.851598
H  -2.794818 3.065441 0.392446
H  -3.048304 1.785386 -0.827876
H  0.052363 -4.32795 0.650202
H  0.821288 2.599215 -0.933607
H  4.858772 -0.061585 0.278646
H  -2.200383 -2.554973 -2.617088
H  -1.421075 -4.593029 -1.364515
H  3.089704 3.48628 -1.492484
H  5.136206 2.118964 -0.898853
H  -4.719921 1.918935 1.629013
H  -5.298698 3.793084 -0.07579
H  -6.54513 2.526457 0.210853
H  -5.48063 2.4208 -1.214528
