program: Gaussian 09
title: 000162834
version: EM64L-G09RevD.01
frameworkgroup: C1[X(C11H11ClN4O2)]
method: RPBEPBE
basis: SDD
operation: Freq
keyword: #p
keyword: freq=noraman
keyword: PBEPBE/SDD
title: #p freq=noraman PBEPBE/SDD
converged: YES YES NO NO
title: Mulliken charges:
elementType: Cl O O N N N N C C C C C C C C C C C H H H H H H H H H H H
charge: -0.064195 -0.189464 -0.184412 -0.214033 -0.478107 -0.050074 -0.515431 -0.477680 0.338981 0.027907 -0.655376 0.302737 0.515621 -0.436919 -0.342557 -0.044788 -0.190447 -0.255823 0.262076 0.263603 0.244236 0.229234 0.258783 0.311636 0.292620 0.243122 0.312007 0.236970 0.259776
chargesum: 0.00000
title: Mulliken charges with hydrogens summed into heavy atoms:
elementType: Cl O O N N N N C C C C C C C C C C C
charge: -0.064195 -0.189464 -0.184412 -0.214033 -0.166471 -0.050074 -0.222811 0.047998 0.338981 0.027907 0.076876 0.302737 0.515621 -0.193797 -0.030550 -0.044788 0.046523 0.003953
polarizability: 2.85597686e+02 -1.14551424e+01 1.75672988e+02 4.22318579e-02 -6.53492842e-02 7.22712228e+01
1716.lowfreq: -32.8216 -6.7572 -3.9358 -2.4861 -0.0022 -0.0022 -0.0019 30.1905 42.9006
frequency: -32.7942 30.1840 42.8804 49.9461 54.8783 70.2745 117.5927 135.2495 173.6538 181.8189 186.9089 222.0359 229.0206 245.7629 287.6607 350.1817 364.2396 409.2847 423.2724 442.8021 522.6372 542.5559 552.5882 562.6120 577.5514 604.6420 657.5138 682.8285 685.7916 694.5366 713.6120 764.9763 791.0600 804.1808 843.5094 854.8877 908.5719 913.9461 962.7978 977.2692 979.6581 993.2350 1023.2644 1072.9863 1094.6131 1099.1936 1103.0757 1148.7647 1155.0415 1175.3226 1182.0760 1214.9435 1254.3041 1280.5169 1304.9929 1349.2202 1369.3733 1412.0431 1438.9342 1457.9713 1470.1780 1480.1162 1485.4452 1501.0502 1525.5843 1547.1832 1590.4259 1613.6497 1670.7975 1695.9567 2942.6697 3003.4788 3011.3286 3067.3815 3102.1857 3136.8952 3149.9328 3180.9221 3204.5754 3520.0143 3538.6330
redmass: 5.3413 6.3336 4.0832 2.3070 3.6993 2.3125 2.7365 10.0515 4.8449 5.6247 4.8013 2.6236 3.3886 9.3850 4.9458 6.7633 6.3412 8.6198 1.7968 2.5286 5.1236 2.6634 7.0747 3.0381 6.1359 1.4101 7.2515 2.5215 7.6462 7.2276 10.5689 6.8853 1.3034 6.9577 5.8398 1.6190 6.3063 1.3640 2.0615 5.8233 6.4730 1.3138 2.1359 2.2133 3.8877 1.5793 1.3033 2.0901 1.3796 2.2836 1.1267 1.9822 1.9023 3.8720 1.6281 2.3830 4.5516 3.3153 1.0987 1.2514 2.5634 1.0544 1.1445 2.2986 4.2302 2.0727 4.3722 6.5687 10.9076 5.9470 1.0386 1.0575 1.1020 1.1062 1.0941 1.0924 1.0890 1.0958 1.0953 1.0766 1.0753
irintensity: 1.1104 0.3653 11.0922 2.2179 3.5772 0.0377 0.5603 0.4405 0.8609 0.7498 0.8883 11.6313 3.0162 0.3381 1.6822 4.2192 7.1508 4.5707 1.4051 5.5413 5.5447 2.2937 18.8134 23.5990 5.0888 112.4761 9.2170 22.3311 9.7699 8.6247 42.1097 5.7253 55.9298 39.2406 12.8028 48.3460 9.2976 4.4186 1.8360 39.1153 13.2216 4.0107 2.0071 80.5535 602.4358 1.3503 57.6234 80.0997 15.2406 85.2391 7.0282 96.8736 27.3854 13.5796 72.3555 22.2265 253.8529 38.5682 0.3974 251.8319 540.7311 28.6958 61.2380 1000.3782 251.9371 254.2186 149.1763 77.6714 277.5821 98.2023 66.4068 15.0903 36.1505 10.7394 9.3559 6.9307 8.0163 2.3746 8.5769 3.4927 17.5580
temp: 298.150 k
press: 1.00000 atm
elementType: 17 8 8 7 7 7 7 6 6 6 6 6 6 6 6 6 6 6 1 1 1 1 1 1 1 1 1 1 1
symmnumber: 1
zpe: 557362.0 jmol-1
zpe.correction: 0.212288 hartree
zpe.thermalcorrener: 0.228661 hartree
zpe.thermalcorrenthalpy: 0.229605 hartree
zpe.thermalcorrgfe: 0.166057 hartree
zpe.sumelectzpe: -1253.989865 hartree
zpe.sumelectthermal: -1253.973492 hartree
zpe.sumelectthermalent: -1253.972548 hartree
zpe.sumelectthermalfe: -1254.036096 hartree
dipole: -1.4145 9.4850 0.0936
dipole: 9.5903
quadrupole: -133.2126 -106.9991 -113.5792
quadrupole: 43.6971 0.3364 -0.0678
quadrupole: -15.2823 10.9312 4.3511 43.6971 0.3364 -0.0678
hfenergy: -1254.202153 hartree
pointgroup: C01 [X(C11H11Cl1N4O2)]
dipole: 0.3625894 -3.7553932 0.0440203 debye
polarizability: 284.1186867|-17.076637|177.1518263|-0.0757766|-0.1309471|72.2713843 unknown
InChI: InChI=1S/C11H11ClN4O2/c1-16-6-9(17)14-10(16)15-11(18)13-8-4-2-3-7(12)5-8/h2-5,13,15H,6H2,1H3
charge 0 multiplicity 1
29 atoms
Cl 5.994324 -1.833108 -0.008215
O  -5.393558 1.882951 -0.005857
O  -0.261141 1.50402 0.000897
N  -3.656421 -1.232557 -0.017691
N  -1.356174 -0.606703 -0.011547
N  -3.152939 1.039389 -0.016693
N  0.973008 -0.505001 -0.008569
C  -4.973367 -0.577928 0.009458
C  -2.693521 -0.220175 -0.014521
C  -4.572827 0.937315 -0.005279
C  -3.43604 -2.676855 0.049507
C  -0.209901 0.257377 -0.006007
C  2.309932 -0.013284 -0.001489
C  3.345261 -0.988581 -0.007299
C  2.63911 1.368665 0.010996
C  4.68277 -0.563575 -0.000397
C  3.99742 1.749533 0.017652
C  5.042095 0.796915 0.01217
H  -5.545148 -0.814423 0.925635
H  -5.585851 -0.824151 -0.876557
H  -3.023838 -3.000743 1.027483
H  -2.76869 -3.032193 -0.761952
H  -4.399934 -3.190802 -0.089025
H  -1.190237 -1.614829 -0.011056
H  0.897601 -1.524408 -0.017298
H  3.112299 -2.059525 -0.017197
H  1.843456 2.114306 0.014993
H  4.249321 2.815144 0.027357
H  6.09189 1.100726 0.017403
