program: Gaussian 09
title: 000162833
version: EM64L-G09RevD.01
frameworkgroup: C1[X(C16H22N2O3)]
method: RPBEPBE
basis: SDD
operation: Freq
keyword: #p
keyword: freq=noraman
keyword: PBEPBE/SDD
title: #p freq=noraman PBEPBE/SDD
converged: YES YES NO NO
title: Mulliken charges:
elementType: O O O N N C C C C C C C C C C C C C C C C H H H H H H H H H H H H H H H H H H H H H H
charge: -0.290149 -0.260928 -0.257108 -0.091145 -0.467463 -0.381847 -0.386390 -0.311026 -0.254713 -0.684070 -0.697567 0.184750 0.232723 -0.334539 -0.338756 0.490738 -0.446586 -0.336255 0.225799 -0.229124 -0.476887 0.204577 0.221837 0.216163 0.221924 0.186310 0.207376 0.237966 0.229125 0.223530 0.220377 0.217103 0.230837 0.214434 0.213039 0.270971 0.269417 0.223371 0.310866 0.304478 0.207684 0.227039 0.252121
chargesum: 0.00000
title: Mulliken charges with hydrogens summed into heavy atoms:
elementType: O O O N N C C C C C C C C C C C C C C C C
charge: -0.290149 -0.260928 -0.257108 -0.091145 -0.162986 0.044567 0.051696 0.082660 0.212378 -0.023060 -0.039257 0.184750 0.232723 -0.063568 -0.069338 0.490738 -0.223215 -0.025389 0.225799 -0.021440 0.002273
polarizability: 3.57119584e+02 -3.82111462e+01 2.10500561e+02 -8.78433846e+00 -3.41333890e-01 1.12716742e+02
1716.lowfreq: -3.7400 -0.0004 0.0005 0.0011 1.6536 5.4476 14.3433 20.3426 30.4918
frequency: 13.4456 20.2925 30.4322 44.6558 52.2431 60.8808 74.0418 79.0222 91.6220 101.2259 118.5073 143.1689 160.8528 174.9889 191.1628 214.9230 225.3733 259.8393 269.3626 294.1289 300.5842 320.4725 329.5136 356.2905 401.2980 413.6384 425.5064 469.3885 489.4498 495.7433 536.2400 537.9880 621.8478 638.2072 645.6322 679.7377 683.7066 734.3714 760.4911 772.2254 782.0656 782.9490 796.0037 810.7903 837.6349 842.8979 882.5466 895.0318 907.5672 917.4359 975.2114 977.9171 982.2714 994.5047 1005.2566 1008.9953 1038.4402 1058.0045 1063.7741 1065.3902 1066.9855 1086.3500 1092.2061 1116.9726 1121.6432 1156.6144 1162.5497 1182.2863 1204.6707 1232.7373 1247.8442 1262.2198 1272.9133 1287.9788 1299.0292 1315.4943 1319.6213 1334.3436 1342.7888 1370.4520 1371.4331 1378.4881 1384.7666 1386.4607 1405.7124 1421.7691 1457.1960 1467.6516 1468.0440 1474.8697 1478.7143 1482.3293 1490.2017 1491.9150 1499.4282 1505.6759 1583.4116 1605.7151 1615.7198 1620.7834 1647.6754 2861.7830 2909.4819 2978.0912 2985.3872 2992.5640 3016.1476 3021.0083 3037.7285 3043.3769 3073.2615 3078.2749 3081.4022 3090.1797 3092.3592 3093.8549 3110.6393 3115.4237 3163.0463 3171.8419 3199.0175 3220.7099 3520.7526
redmass: 3.5825 4.0061 4.4423 4.7573 6.0127 2.6294 3.7375 3.4650 4.0643 2.9034 3.3586 2.9845 2.2530 2.2037 3.3938 4.4094 1.1362 4.8324 2.0062 1.7447 4.1912 4.5039 3.8954 6.5959 2.3681 2.9571 4.4033 4.1408 2.8497 2.2020 3.5075 2.2496 5.7009 5.9212 1.2033 4.1372 4.0733 3.3391 4.3281 1.1605 3.2179 1.5019 1.7339 1.6226 5.7164 1.4084 1.5080 2.1759 4.2281 5.6554 2.5074 1.1921 1.3603 1.2465 3.3369 1.3322 2.4191 1.6672 2.2709 3.3174 1.7936 2.1376 2.9983 1.6593 1.3356 2.9782 1.3742 1.1619 2.0780 1.7597 2.3591 2.3988 1.1145 1.2220 1.3306 1.4924 1.4091 1.3474 1.2316 3.9459 1.3757 1.2715 1.3490 1.2884 1.2318 4.6708 1.0632 1.0613 1.0580 1.0553 1.0632 1.0577 1.0780 2.1332 1.0738 3.0123 6.6068 5.3280 8.0419 5.8556 4.6411 1.0714 1.0692 1.0351 1.0366 1.0608 1.0830 1.0611 1.0950 1.0972 1.0989 1.0997 1.1001 1.1006 1.1085 1.0727 1.0807 1.0899 1.0947 1.0906 1.0957 1.1164 1.0761
irintensity: 1.0215 1.4397 0.5748 0.9092 7.4248 0.3422 2.3952 0.2844 0.3508 0.3261 1.1179 2.2650 1.2480 0.9470 0.9683 1.9589 0.1752 1.7724 0.5235 2.0845 21.2412 2.9541 7.4192 15.6018 3.7830 0.0004 1.3126 2.8076 14.9165 5.7615 4.3611 16.9746 0.7193 0.0469 48.7989 31.7032 5.0667 10.4500 8.6186 7.0850 35.4962 3.9588 1.2643 8.8952 2.0442 28.2265 54.3549 8.5165 23.9973 20.5500 11.4292 8.7120 0.0122 81.2017 51.9057 1.9965 5.5614 63.2708 59.9374 443.0066 13.1110 31.2650 12.9292 9.6090 9.7207 121.0807 8.8099 146.9051 30.6205 25.9562 329.5307 156.6316 0.7545 16.6373 23.7193 37.8680 15.1307 11.9212 13.6850 92.9393 13.3263 28.6444 22.2838 12.7257 85.2805 21.5097 8.0784 14.7165 5.6590 3.6080 5.1852 8.6915 19.0601 241.0943 1.6407 272.7755 9.9134 166.6657 197.2505 87.7285 10.2066 88.2463 65.1873 27.2127 27.8515 47.4211 25.6827 17.9394 8.0522 18.9158 46.9611 66.4703 45.5825 45.4539 35.2286 9.8114 10.3053 19.0166 4.7580 1.0151 3.9959 7.6761 12.9442
temp: 298.150 k
press: 1.00000 atm
elementType: 8 8 8 7 7 6 6 6 6 6 6 6 6 6 6 6 6 6 6 6 6 1 1 1 1 1 1 1 1 1 1 1 1 1 1 1 1 1 1 1 1 1 1
symmnumber: 1
zpe: 929661.0 jmol-1
zpe.correction: 0.354089 hartree
zpe.thermalcorrener: 0.376669 hartree
zpe.thermalcorrenthalpy: 0.377614 hartree
zpe.thermalcorrgfe: 0.298487 hartree
zpe.sumelectzpe: -956.474013 hartree
zpe.sumelectthermal: -956.451433 hartree
zpe.sumelectthermalent: -956.450489 hartree
zpe.sumelectthermalfe: -956.529616 hartree
dipole: -2.2851 -0.1091 0.6555
dipole: 2.3798
quadrupole: -78.8617 -132.0177 -128.4594
quadrupole: 22.3522 0.4664 -2.6566
quadrupole: 34.2513 -18.9047 -15.3465 22.3522 0.4664 -2.6566
hfenergy: -956.8281024 hartree
pointgroup: C01 [X(C16H22N2O3)]
dipole: 0.8989716 0.05708 0.2553327 debye
polarizability: 358.4878593|-35.6340564|209.1739992|7.7044533|1.3104298|112.6750278 unknown
InChI: InChI=1S/C16H22N2O3/c1-4-15(19)17-14-9-7-13(8-10-14)16(20)21-12-11-18(5-2)6-3/h4,7-10,17H,1,5-6,11-12H2,2-3H3
charge 0 multiplicity 1
43 atoms
O  -1.65013 0.340681 -0.287678
O  -1.289584 2.644883 -0.283453
O  4.947008 -2.010164 0.088272
N  -5.279609 -0.573229 -0.164799
N  4.787387 0.340785 0.085845
C  -3.809156 -0.759418 -0.171457
C  -6.034548 -1.631644 -0.880229
C  -5.809322 -0.200097 1.172048
C  -3.116833 0.594583 -0.382434
C  -6.042107 -3.037901 -0.21924
C  -7.235927 0.377125 1.124325
C  -0.831085 1.473793 -0.249605
C  0.611787 1.121903 -0.16383
C  1.557985 2.179056 -0.107164
C  1.072649 -0.219497 -0.137562
C  3.38806 0.548652 0.00128
C  2.929062 1.897438 -0.025404
C  2.445595 -0.516401 -0.056237
C  5.499002 -0.869348 0.125525
C  6.981601 -0.677772 0.216573
C  7.821506 -1.742997 0.26326
H  -3.423494 -1.224369 0.765734
H  -3.529835 -1.434183 -1.001039
H  -5.606752 -1.710012 -1.898011
H  -7.076022 -1.284625 -1.011749
H  -5.778307 -1.059828 1.88837
H  -5.134166 0.570891 1.589022
H  -3.348371 1.013175 -1.377038
H  -3.401806 1.339304 0.381682
H  -5.015704 -3.43001 -0.094924
H  -6.523796 -3.018938 0.775358
H  -6.602836 -3.752202 -0.850628
H  -7.28376 1.218204 0.410339
H  -7.981836 -0.378708 0.819333
H  -7.529076 0.746789 2.124065
H  1.193514 3.211063 -0.128726
H  0.34179 -1.031483 -0.182176
H  3.652472 2.721881 0.018066
H  2.803328 -1.546812 -0.036362
H  5.35277 1.192897 0.122652
H  7.376842 0.347813 0.244788
H  8.907334 -1.621857 0.329811
H  7.410373 -2.758921 0.233999
