program: Gaussian 09
title: 000013298
version: EM64L-G09RevD.01
frameworkgroup: C1[X(C16H15NO2)]
method: RPBEPBE
basis: SDD
operation: Freq
keyword: #p
keyword: freq=noraman
keyword: PBEPBE/SDD
title: #p freq=noraman PBEPBE/SDD
converged: YES YES NO NO
title: Mulliken charges:
elementType: O O N C C C C C C C C C C C C C C C C H H H H H H H H H H H H H H H
charge: -0.373732 -0.255913 -0.185939 0.541053 0.411106 -0.383366 -0.417864 -0.434183 -0.365962 -0.333138 0.496754 -0.325897 -0.392702 -0.407077 0.208714 -0.236601 -0.238413 -0.246167 -0.751315 0.224764 0.230172 0.267212 0.304697 0.219711 0.211851 0.222405 0.225148 0.224899 0.225936 0.229311 0.260331 0.227356 0.250453 0.366395
chargesum: 0.00000
title: Mulliken charges with hydrogens summed into heavy atoms:
elementType: O O N C C C C C C C C C C C C C C C C
charge: -0.007336 -0.255913 -0.185939 0.541053 0.411106 -0.158602 -0.187692 -0.166971 -0.061265 -0.113427 0.496754 -0.114046 -0.170297 -0.181929 0.208714 -0.011702 -0.012477 -0.016856 -0.013175
polarizability: 4.68775501e+02 -9.51195906e+00 1.83155529e+02 1.51525502e+00 -1.60724989e+00 8.12923117e+01
1716.lowfreq: -7.9712 -2.5006 -0.0009 -0.0008 -0.0005 4.2032 20.1120 29.3085 49.0093
frequency: 20.1010 29.3065 49.0014 51.6792 70.2022 95.3094 134.6303 140.2221 159.4412 170.1828 224.7322 260.7335 262.8350 300.5173 322.8317 362.0715 382.3619 403.2034 403.3726 411.3570 468.1270 489.5593 533.8864 539.4377 556.6835 571.6319 596.4097 615.7012 635.8983 681.1020 694.3760 729.2876 768.7844 816.6661 834.5968 838.6373 846.6921 865.5202 889.2768 898.0879 923.0279 962.8717 975.3418 977.8252 985.0591 986.9247 992.7615 996.6381 1007.6771 1011.6324 1025.8952 1029.6529 1083.5500 1129.9244 1172.1735 1185.5128 1191.2814 1204.5932 1213.8597 1247.2120 1290.7420 1295.3595 1304.9373 1321.0892 1339.9000 1349.7428 1378.4687 1382.2283 1389.0733 1427.9081 1440.9034 1445.1187 1456.2944 1482.1680 1498.9927 1562.5081 1580.9526 1599.6542 1604.6338 1618.5065 1645.0729 3002.1838 3087.1510 3090.9782 3098.1285 3116.9171 3124.7489 3127.8992 3136.9288 3137.7950 3138.6513 3147.8476 3164.7429 3178.9411 3206.2062 3434.1681
redmass: 4.4025 4.7100 4.6711 5.1146 4.1493 3.8264 1.0659 3.9200 5.1940 5.8947 3.1537 3.8949 4.9334 1.1537 4.8288 4.2422 4.2212 2.8254 6.3941 3.0214 4.3022 2.8528 4.9445 2.9650 3.0570 5.9054 5.8394 6.4343 7.1028 5.6678 1.7376 2.9905 1.8816 5.2594 1.3544 1.4239 1.3434 3.8932 1.7921 4.9237 1.6387 1.3126 1.3709 1.2939 1.2848 5.9515 2.5985 1.2819 2.8008 2.9906 2.1907 1.6915 1.6277 1.4095 1.0644 1.5513 1.1249 2.4019 1.9068 1.4082 2.3095 2.3605 1.4812 1.4264 1.2880 1.7912 3.2739 1.4093 4.8581 3.6345 2.3159 1.0891 1.0489 2.2635 2.6684 6.7505 5.5953 7.6454 5.9040 6.1649 5.3519 1.0376 1.0915 1.0960 1.0860 1.0867 1.0858 1.0906 1.1011 1.0911 1.0890 1.0960 1.1015 1.0938 1.0942 1.0682
irintensity: 0.8647 0.9576 3.4153 0.6372 2.0198 1.5002 2.3257 5.9067 1.8788 0.6425 11.6651 2.4035 2.5359 99.3957 57.2535 5.9739 6.3124 0.0978 3.8720 0.8996 0.4486 0.9438 3.1325 32.9503 0.3360 22.1151 13.5721 0.2146 1.9208 3.7634 49.3503 12.2350 28.7988 1.1737 17.4910 31.5267 26.1058 2.1361 8.9482 9.4056 0.0010 25.1859 1.3131 15.1616 16.0732 0.2231 29.1763 12.4713 36.3018 11.9627 6.7221 9.0836 9.5146 4.9899 0.1714 2.3402 0.5543 0.8930 58.8138 2.8304 69.2522 311.1700 56.0058 39.6875 0.0655 244.4435 70.0437 20.2397 6.3773 24.8105 8.0304 23.9292 18.3605 1.3313 183.1434 1.2813 2.6032 199.9402 22.0783 2.6501 0.5838 8.5973 0.8512 11.5441 44.5207 13.2183 1.8349 16.1948 11.1282 7.0803 7.4683 45.0359 40.9451 3.5948 2.4013 7.5771
temp: 298.150 k
press: 1.00000 atm
elementType: 8 8 7 6 6 6 6 6 6 6 6 6 6 6 6 6 6 6 6 1 1 1 1 1 1 1 1 1 1 1 1 1 1 1
symmnumber: 1
zpe: 700027.2 jmol-1
zpe.correction: 0.266626 hartree
zpe.thermalcorrener: 0.284190 hartree
zpe.thermalcorrenthalpy: 0.285135 hartree
zpe.thermalcorrgfe: 0.219045 hartree
zpe.sumelectzpe: -822.511248 hartree
zpe.sumelectthermal: -822.493684 hartree
zpe.sumelectthermalent: -822.492739 hartree
zpe.sumelectthermalfe: -822.558829 hartree
dipole: 0.0836 2.8934 1.9452
dipole: 3.4874
quadrupole: -94.3603 -103.6574 -116.4511
quadrupole: 14.8966 9.2684 1.2008
quadrupole: 10.4626 1.1655 -11.6282 14.8966 9.2684 1.2008
hfenergy: -822.777874 hartree
pointgroup: C01 [X(C16H15N1O2)]
dipole: 0.0300642 -1.1429093 -0.7585596 debye
polarizability: 468.78804|9.1813145|183.112046|-2.377367|-2.2310134|81.323256 unknown
InChI: InChI=1S/C16H15NO2/c1-13(18)17(19)16-11-9-15(10-12-16)8-7-14-5-3-2-4-6-14/h2-12,19H,1H3
charge 0 multiplicity 1
34 atoms
O  4.720988 -1.781656 -0.167363
O  5.160206 1.763914 0.249236
N  4.327803 -0.380621 -0.115819
C  0.069895 0.234564 -0.055785
C  2.913527 -0.146217 -0.071905
C  0.643612 -1.06467 0.066167
C  0.972648 1.330259 -0.173525
C  2.034037 -1.25761 0.060524
C  2.368677 1.163214 -0.184538
C  -1.375716 0.494429 -0.059062
C  -3.827406 -0.176569 0.019449
C  -2.379251 -0.436972 0.020598
C  -4.393636 1.131053 -0.062658
C  -4.722168 -1.28361 0.104412
C  5.387085 0.529444 0.091223
C  -5.789502 1.316531 -0.060523
C  -6.120225 -1.098626 0.106757
C  -6.663262 0.204221 0.023919
C  6.784523 -0.069545 0.09456
H  -0.002773 -1.941589 0.179454
H  0.567173 2.34599 -0.26024
H  2.449451 -2.260134 0.188638
H  3.035671 2.022076 -0.259409
H  -1.64953 1.556406 -0.135737
H  -2.105538 -1.499676 0.092588
H  -3.739693 2.007705 -0.127683
H  -4.308355 -2.298007 0.169372
H  -6.202412 2.32981 -0.124255
H  -6.785277 -1.967013 0.173162
H  -7.74861 0.353201 0.025562
H  6.884171 -0.852477 0.864822
H  7.029148 -0.536265 -0.876641
H  7.494881 0.746769 0.291968
H  4.624559 -2.045226 -1.126869
