program: Gaussian 09
title: 000162673
version: EM64L-G09RevD.01
frameworkgroup: C1[X(C16H14O5S)]
method: RPBEPBE
basis: SDD
operation: Freq
keyword: #p
keyword: freq=noraman
keyword: PBEPBE/SDD
title: #p freq=noraman PBEPBE/SDD
converged: YES YES NO NO
title: Mulliken charges:
elementType: S O O O O O C C C C C C C C C C C C C C C C H H H H H H H H H H H H H H
charge: 0.980433 -0.274189 -0.275479 -0.565656 -0.505956 -0.505630 0.356363 0.378880 0.367871 0.358624 -0.270723 -0.253247 -0.391690 -0.088355 -0.404963 -0.253533 -0.418902 -0.418726 -0.241184 -0.238120 -0.524996 -0.527593 0.320127 0.288380 0.284746 0.280029 0.278912 0.235328 0.234674 0.229635 0.244757 0.235334 0.241231 0.231173 0.230839 0.381604
chargesum: 0.00000
title: Mulliken charges with hydrogens summed into heavy atoms:
elementType: S O O O O O C C C C C C C C C C C C C C C C
charge: 0.980433 -0.274189 -0.275479 -0.184052 -0.505956 -0.505630 0.356363 0.378880 0.367871 0.358624 -0.270723 -0.253247 -0.071563 -0.088355 -0.116583 0.031214 -0.138873 -0.139815 -0.005856 -0.003445 0.184729 0.175650
polarizability: 3.82773024e+02 1.92006776e+01 2.41693672e+02 -7.04688166e+00 -5.36320353e-01 1.14877836e+02
1716.lowfreq: -7.1434 -0.0010 -0.0005 0.0016 7.7444 9.9366 23.9911 37.1709 46.7675
frequency: 23.9563 37.1391 46.7322 56.9560 70.6727 92.2640 109.8898 127.8998 136.5126 148.1281 148.8219 160.4891 187.1470 195.2236 208.1753 234.4317 256.5805 270.2285 287.5670 296.0257 321.3304 350.4115 363.1726 389.3201 414.2896 426.1558 457.5321 471.3923 476.8031 484.2470 521.5472 565.4548 587.3812 614.3911 639.9755 651.0880 667.4068 697.1055 745.2958 752.3349 788.3145 822.0399 833.1714 862.2923 896.9688 898.3714 910.3301 922.0080 928.4628 944.3527 965.2755 981.9643 990.0796 1002.9424 1020.8796 1040.8364 1043.8756 1053.6074 1089.8107 1108.0860 1108.7954 1116.7494 1146.8493 1149.0906 1163.0312 1172.1778 1214.8540 1255.9343 1297.6069 1319.4732 1333.6868 1351.3369 1410.5798 1425.4543 1425.6958 1438.0208 1443.1753 1448.5738 1458.3782 1459.8311 1469.5993 1471.7790 1480.4354 1536.9239 1557.0163 1566.3651 1607.8103 1626.4459 2963.6588 2965.9008 3054.3371 3057.8116 3121.7436 3126.0105 3134.1192 3148.8582 3159.2058 3163.4520 3164.2262 3172.4483 3177.7315 3479.2826
redmass: 8.1646 4.2697 3.3882 3.1123 4.2579 7.1413 4.4620 3.6618 4.0590 1.0416 1.0708 1.8349 6.8943 3.7567 4.9174 4.1850 5.4950 4.5722 5.1072 6.2411 8.2928 7.9072 9.1158 8.4042 3.8792 6.7155 6.1549 3.4585 3.9672 7.0056 6.3376 7.8070 5.8055 7.1725 4.5951 6.1689 6.2101 3.4042 4.2028 6.1783 1.4980 1.5806 13.4728 1.7547 7.6371 6.4691 2.2282 5.5719 6.2298 1.9347 15.4584 1.3565 1.3435 1.3251 2.1092 3.2758 1.8918 1.5757 5.3124 1.2387 1.2432 1.8669 1.3560 1.4577 1.2839 1.1070 1.4551 1.4709 2.7570 4.0298 4.6014 2.1457 4.2419 1.6801 2.9215 2.2553 1.5248 2.7415 1.0542 1.0543 1.1864 1.0651 2.2864 7.4478 7.4418 8.4087 7.5476 6.3570 1.0310 1.0312 1.1046 1.1049 1.1014 1.1013 1.0858 1.0890 1.0876 1.0950 1.0922 1.1001 1.0981 1.0661
irintensity: 2.4639 0.8755 1.7882 6.5521 0.0595 0.0673 1.2384 1.1000 2.7510 0.0719 0.5218 49.5353 6.4338 13.5704 2.4676 0.2103 9.6421 1.3036 53.3197 27.7091 19.7182 4.7055 25.8269 29.7847 12.1993 24.7277 3.6905 5.0110 2.4836 11.1962 82.6040 131.7415 6.9084 13.7573 11.6170 22.0988 2.2718 16.4236 1.1513 3.7296 62.4480 29.6914 88.9616 16.0792 37.8705 8.1291 10.6750 5.4462 0.5569 9.1081 93.6506 1.9195 0.6718 0.4489 5.6102 134.0823 87.8557 88.9681 29.3227 0.0528 0.1860 0.9216 9.9420 11.5677 5.1607 1.3301 1.6241 4.1804 26.1234 86.2481 136.1657 24.6401 29.0685 3.7260 0.5927 3.8417 20.8604 14.2165 9.5650 13.7952 1.6767 9.7023 4.9739 2.7152 1.7404 1.9713 18.5946 11.8812 50.8332 56.7785 28.5270 29.9528 26.6184 20.1361 5.4328 6.7207 7.4299 12.1980 3.8340 30.3510 3.3749 45.1508
temp: 298.150 k
press: 1.00000 atm
elementType: 16 8 8 8 8 8 6 6 6 6 6 6 6 6 6 6 6 6 6 6 6 6 1 1 1 1 1 1 1 1 1 1 1 1 1 1
symmnumber: 1
zpe: 688687.8 jmol-1
zpe.correction: 0.262307 hartree
zpe.thermalcorrener: 0.283682 hartree
zpe.thermalcorrenthalpy: 0.284626 hartree
zpe.thermalcorrgfe: 0.211075 hartree
zpe.sumelectzpe: -1390.509103 hartree
zpe.sumelectthermal: -1390.487728 hartree
zpe.sumelectthermalent: -1390.486784 hartree
zpe.sumelectthermalfe: -1390.560335 hartree
dipole: -5.9828 0.5571 -1.8613
dipole: 6.2904
quadrupole: -134.7626 -122.9665 -138.9485
quadrupole: 1.2973 14.6944 -0.9971
quadrupole: -2.5368 9.2594 -6.7226 1.2973 14.6944 -0.9971
hfenergy: -1390.7714099 hartree
pointgroup: C01 [X(C16H14O5S1)]
dipole: -2.3244413 -0.3109709 0.790638 debye
polarizability: 384.1435922|-14.1445497|240.4926963|-0.1854829|1.4030989|114.7082426 unknown
InChI: InChI=1S/C16H14O5S/c1-20-15-11-5-3-4-6-12(11)16(21-2)14-9-10(22(17,18)19)7-8-13(14)15/h3-9,17H,1-2H3
charge 0 multiplicity 1
36 atoms
S  4.41707 0.317738 -0.035291
O  -0.435263 2.700553 -0.023623
O  -1.722336 -2.829447 -0.141259
O  4.683243 0.314801 -1.876195
O  4.535735 1.838643 0.505054
O  5.335732 -0.851328 0.606733
C  0.28378 0.366239 -0.073414
C  -0.040247 -1.055924 -0.109325
C  -2.128216 0.92954 -0.110569
C  -2.455195 -0.490624 -0.139983
C  -0.763976 1.32716 -0.045139
C  -1.404403 -1.450273 -0.107436
C  1.663168 0.767401 -0.073272
C  2.62943 -0.219604 -0.085475
C  1.029386 -2.020765 -0.1425
C  2.360269 -1.621154 -0.12682
C  -3.196913 1.892695 -0.155523
C  -3.838119 -0.882681 -0.210643
C  -4.523344 1.476839 -0.210336
C  -4.84651 0.075905 -0.237545
C  -0.346134 3.29951 1.329222
C  -1.901551 -3.450239 1.191182
H  1.921319 1.830588 -0.074352
H  0.767344 -3.080451 -0.208899
H  3.184589 -2.339377 -0.141928
H  -2.935789 2.954919 -0.177646
H  -4.070607 -1.949754 -0.275615
H  -5.330093 2.216285 -0.253167
H  -5.895555 -0.232776 -0.300499
H  -1.311947 3.211191 1.86223
H  -0.098296 4.358678 1.165332
H  0.451429 2.812676 1.922004
H  -2.139695 -4.506573 0.995323
H  -2.732724 -2.969227 1.741443
H  -0.972351 -3.375346 1.788105
H  5.646871 0.534283 -2.039276
