program: Gaussian 09
title: 000162669
version: EM64L-G09RevD.01
frameworkgroup: C1[X(C19H29NO3)]
method: RPBEPBE
basis: SDD
operation: Freq
keyword: #p
keyword: freq=noraman
keyword: PBEPBE/SDD
title: #p freq=noraman PBEPBE/SDD
converged: YES YES NO NO
title: Mulliken charges:
elementType: O O O N C C C C C C C C C C C C C C C C C C C H H H H H H H H H H H H H H H H H H H H H H H H H H H H H
charge: -0.473884 -0.245358 -0.277278 -0.095295 0.290055 -0.481865 -0.504420 -0.437064 -0.427880 -0.456314 0.492333 0.258121 -0.392584 -0.428310 -0.305956 -0.234364 -0.233379 -0.368087 -0.246112 -0.383907 -0.319156 -0.680554 -0.692594 0.191228 0.238042 0.247248 0.224047 0.224192 0.216842 0.203139 0.216050 0.244449 0.353432 0.286207 0.233347 0.236867 0.234105 0.224911 0.224140 0.231955 0.223219 0.227351 0.220313 0.214541 0.191218 0.221616 0.221077 0.223773 0.216543 0.213246 0.226603 0.214148
chargesum: 0.00000
title: Mulliken charges with hydrogens summed into heavy atoms:
elementType: O O O N C C C C C C C C C C C C C C C C C C C
charge: -0.120452 -0.245358 -0.277278 -0.095295 0.290055 -0.052595 -0.033125 0.003970 -0.008690 -0.211865 0.492333 0.258121 -0.106376 -0.194963 0.165017 -0.009453 -0.009238 0.087086 -0.018762 0.050947 0.093679 -0.019161 -0.038596
polarizability: 2.26429566e+02 -5.93376384e+00 2.37609730e+02 3.72995652e+00 -1.06861725e+00 1.90942292e+02
1716.lowfreq: -11.6137 -8.0085 -3.8203 -0.0006 -0.0003 0.0001 3.8109 12.6536 18.1385
frequency: -2.4040 11.5243 17.9126 22.7493 39.1220 54.3608 58.3900 63.0502 83.0391 94.4336 105.4425 124.9276 149.4743 171.4257 208.7729 218.5452 222.5304 227.1049 263.4368 273.6968 280.5033 286.9541 288.6451 306.8164 327.9291 388.3909 401.7082 403.3711 417.8204 448.3225 484.8852 492.9709 519.4543 558.4908 567.2185 614.5293 633.5586 662.6376 693.3020 708.1363 712.2027 741.3940 757.5163 770.9123 787.0125 795.4055 797.3063 806.6794 831.0649 854.9630 857.6572 860.6664 888.3126 895.2807 906.3201 923.0970 935.8653 967.2335 974.9138 980.4642 981.1421 990.7520 1002.0665 1020.9128 1028.0262 1035.2602 1036.6507 1059.1705 1066.8496 1067.5010 1074.3085 1081.8986 1086.7438 1103.1744 1115.6938 1127.2645 1159.1235 1171.5697 1183.2255 1187.1148 1192.3189 1199.7336 1205.7346 1214.2279 1239.5343 1248.6071 1258.4078 1277.9442 1284.3706 1295.4543 1295.8853 1303.7042 1310.2910 1319.4646 1323.3960 1335.0213 1339.0935 1341.6176 1370.7241 1374.0476 1375.7474 1381.9740 1383.5621 1389.3961 1441.5855 1445.9722 1456.5310 1457.4554 1458.4256 1466.1445 1466.7565 1472.1299 1477.2320 1480.2244 1481.0936 1483.0868 1488.5155 1498.1928 1589.1180 1594.1535 1609.5764 2874.6393 2925.3518 2975.1932 2977.6695 2984.0358 2989.1374 2991.2746 3008.6619 3016.5824 3022.3059 3031.4361 3038.8303 3042.0052 3047.9974 3055.0216 3058.9071 3072.9548 3076.1515 3077.4727 3081.7025 3088.7583 3089.8960 3117.4206 3126.4968 3133.1090 3139.9875 3155.4808 3165.8780 3389.3835
redmass: 3.8999 4.0917 4.0484 3.4851 3.5925 3.4166 2.9890 2.5468 3.0576 4.6981 3.2605 4.1205 2.6364 1.5883 1.4728 3.0507 2.0466 3.0798 2.7127 1.5267 2.9502 4.0562 3.2783 5.2448 4.6966 3.5503 2.3284 2.8321 2.8996 2.9222 3.0051 3.2132 3.2061 3.9916 2.2070 5.8418 1.2455 3.3872 4.1035 1.9487 2.3418 3.0267 1.9941 1.1378 3.5920 1.3269 1.6940 1.3210 3.8189 1.9408 1.2535 4.6393 2.3916 2.0468 2.4699 2.4955 1.8944 2.3609 2.4735 1.9474 1.5022 3.5436 1.4244 2.0775 1.9968 1.9510 2.4474 2.5638 1.7602 1.8736 2.0563 1.6535 2.1826 2.8308 1.6515 2.7333 1.5935 1.0711 1.7498 1.9697 1.1419 2.0451 2.0564 1.4281 1.3983 1.4598 1.4596 1.1460 1.4591 1.3437 1.2781 1.3135 1.4154 1.3553 1.3688 1.3424 1.2677 1.2293 1.3575 1.2610 1.8988 1.3005 3.5095 1.2696 2.1495 1.0966 1.0938 1.0630 1.0815 1.0858 1.0483 1.0561 1.0606 2.0287 1.0515 1.1443 1.0731 1.0792 6.4876 6.6226 6.1678 1.0715 1.0683 1.0639 1.0352 1.0368 1.0632 1.0605 1.0609 1.0647 1.0876 1.0829 1.0948 1.0746 1.0832 1.0992 1.0979 1.0990 1.1047 1.0989 1.1008 1.1027 1.1005 1.0859 1.0877 1.1081 1.0933 1.0964 1.0995 1.0650
irintensity: 0.0319 0.1943 0.1183 0.3010 0.4445 0.2620 0.3931 0.1054 0.0587 0.6731 0.4997 1.1480 0.2306 1.8008 0.8478 2.8440 0.9858 1.0691 2.0986 0.3889 1.0616 0.9559 4.2942 12.7502 22.3610 5.2749 3.1229 0.2285 13.9166 10.3071 10.1968 10.7565 8.9895 3.1677 7.4305 6.7104 179.3415 47.3282 4.1463 55.2199 30.6181 2.3327 21.6145 5.1958 28.8484 1.9540 0.4893 5.1819 3.2695 6.9462 1.4871 12.1556 4.2678 8.2302 6.5127 50.9348 11.5010 12.1143 7.3189 22.6443 1.4785 0.5948 1.7875 4.0874 7.0817 10.0187 8.3856 6.2353 35.2470 13.7375 45.4468 19.6163 43.2846 38.7288 10.2375 285.0363 33.5043 0.4380 10.6973 5.2026 0.5539 11.3999 26.8490 3.4651 16.9097 24.2567 23.7491 10.2075 37.3820 9.8191 32.1470 11.4264 8.9002 2.9014 12.9489 4.7619 5.3253 12.4595 15.0696 25.8688 68.6466 8.5224 26.2428 21.1607 8.2956 9.5406 6.7781 15.5478 3.9639 8.7725 14.9851 5.5405 2.7454 24.6264 7.3438 5.6418 15.4438 2.1835 26.8990 83.1501 6.8759 72.9157 52.6337 29.5877 25.8167 26.1089 41.0923 47.1698 58.2198 22.9783 13.2291 7.6433 19.6948 11.2668 25.4510 29.6083 19.1730 43.9825 23.4968 66.2382 44.5890 43.0553 43.1201 4.3411 4.1145 12.3889 31.2372 14.5133 24.3933 111.0284
temp: 298.150 k
press: 1.00000 atm
elementType: 8 8 8 7 6 6 6 6 6 6 6 6 6 6 6 6 6 6 6 6 6 6 6 1 1 1 1 1 1 1 1 1 1 1 1 1 1 1 1 1 1 1 1 1 1 1 1 1 1 1 1 1
symmnumber: 1
zpe: 1171733.2 jmol-1
zpe.correction: 0.446290 hartree
zpe.thermalcorrener: 0.469926 hartree
zpe.thermalcorrenthalpy: 0.470870 hartree
zpe.thermalcorrgfe: 0.389782 hartree
zpe.sumelectzpe: -1020.044714 hartree
zpe.sumelectthermal: -1020.021078 hartree
zpe.sumelectthermalent: -1020.020133 hartree
zpe.sumelectthermalfe: -1020.101221 hartree
dipole: -2.2819 0.9595 -1.9613
dipole: 3.1582
quadrupole: -134.6440 -134.6344 -138.3678
quadrupole: -1.5183 -5.5972 1.4613
quadrupole: 1.2381 1.2477 -2.4858 -1.5183 -5.5972 1.4613
hfenergy: -1020.4910032 hartree
pointgroup: C01 [X(C19H29N1O3)]
dipole: -0.8432506 -0.439016 0.8000635 debye
polarizability: 225.3612479|4.9870395|238.4049913|-4.7321341|-1.6956299|191.2153493 unknown
InChI: InChI=1S/C19H29NO3/c1-3-20(4-2)14-15-23-18(21)17(16-10-6-5-7-11-16)19(22)12-8-9-13-19/h5-7,10-11,17,22H,3-4,8-9,12-15H2,1-2H3
charge 0 multiplicity 1
52 atoms
O  2.355819 1.315415 -1.774225
O  -0.647136 0.667495 1.287157
O  -0.271473 1.38975 -0.891575
N  -4.317422 0.349211 0.409504
C  2.61786 1.229564 -0.318916
C  2.642375 2.670893 0.276513
C  4.081977 0.718413 -0.17693
C  4.050244 3.183855 -0.100539
C  4.954867 1.957575 0.196141
C  1.565891 0.31304 0.397022
C  1.603018 -1.180009 0.027602
C  0.147522 0.846885 0.168931
C  1.675949 -1.625663 -1.318193
C  1.533896 -2.144712 1.065612
C  -2.090208 1.060223 1.166668
C  1.685104 -3.008005 -1.610134
C  1.541975 -3.526572 0.772303
C  -2.920007 -0.102772 0.58648
C  1.615926 -3.963801 -0.570182
C  -5.34747 -0.619666 0.857046
C  -4.561359 0.995692 -0.906166
C  -5.497651 -1.905491 -0.001798
C  -5.818368 1.885015 -0.920876
H  2.542453 2.629517 1.380731
H  1.820582 3.293523 -0.119727
H  4.379276 0.285407 -1.146497
H  4.158624 -0.083914 0.578501
H  4.075554 3.421273 -1.179749
H  4.347539 4.087013 0.46176
H  5.210766 1.93628 1.273362
H  5.904297 1.985396 -0.366781
H  1.751194 0.385005 1.484046
H  1.395965 1.581265 -1.873739
H  1.753486 -0.885979 -2.120512
H  1.468444 -1.809962 2.108297
H  -2.397729 1.294266 2.1962
H  -2.162185 1.956741 0.527789
H  1.748305 -3.339237 -2.65309
H  1.491785 -4.257761 1.587154
H  -2.452713 -0.44942 -0.362811
H  -2.888884 -0.952274 1.292314
H  1.621683 -5.03493 -0.802084
H  -6.319518 -0.094439 0.902429
H  -5.103706 -0.903847 1.898723
H  -4.624447 0.245933 -1.733395
H  -3.679043 1.623355 -1.132368
H  -5.813978 -1.672192 -1.034578
H  -4.546219 -2.466507 -0.054524
H  -6.260683 -2.572724 0.440814
H  -6.745323 1.297266 -0.792797
H  -5.767855 2.630786 -0.107907
H  -5.894897 2.419024 -1.885803
