program: Gaussian 09
title: 000013295
version: EM64L-G09RevD.01
frameworkgroup: C1[X(C15H11NO3)]
method: RPBEPBE
basis: SDD
operation: Freq
keyword: #p
keyword: freq=noraman
keyword: PBEPBE/SDD
title: #p freq=noraman PBEPBE/SDD
converged: NO YES NO NO
title: Mulliken charges:
elementType: O O O N C C C C C C C C C C C C C C C H H H H H H H H H H H
charge: -0.248031 -0.251865 -0.196437 0.004007 0.198847 0.307588 0.188121 0.277856 -0.338637 -0.459541 -0.508853 0.343273 -0.383671 0.125932 -0.325601 -0.325543 -0.325916 -0.325916 -0.535181 0.255275 0.270582 0.282300 0.259640 0.252037 0.252028 0.246625 0.246620 0.231037 0.231046 0.252377
chargesum: 0.00000
title: Mulliken charges with hydrogens summed into heavy atoms:
elementType: O O O N C C C C C C C C C C C C C C C
charge: -0.248031 -0.251865 -0.196437 0.004007 0.198847 0.307588 0.188121 0.277856 -0.083362 -0.188958 -0.226552 0.343273 -0.124031 0.125932 -0.073564 -0.073515 -0.079291 -0.079296 0.179278
polarizability: 2.47840573e+02 1.08386538e+01 2.02891318e+02 5.48832207e-03 5.41098339e-02 1.13601072e+02
1716.lowfreq: -50.1715 -10.7192 -4.4344 -0.0006 -0.0005 0.0003 3.5617 49.0237 57.4559
frequency: -50.0737 49.0137 57.4558 91.5260 96.1073 144.4359 165.5079 201.4825 216.0621 237.4872 256.5703 261.3933 320.2663 324.9030 359.2822 399.4284 450.4447 453.6722 462.2788 505.3215 585.6309 603.7388 607.3034 643.4307 664.7082 664.8942 671.8481 689.2385 746.3912 751.9439 752.9378 779.6073 830.0098 831.5909 855.2089 874.9601 887.4578 908.2230 944.4391 958.6047 965.4294 966.0125 975.3474 989.8792 1064.3372 1082.2622 1090.7425 1103.2657 1110.7904 1154.9558 1166.9748 1179.7869 1220.4761 1248.6907 1262.8743 1278.8278 1288.9485 1325.3717 1377.0405 1383.6152 1397.4244 1435.0852 1438.6546 1463.2739 1466.3735 1470.2923 1501.8277 1539.6307 1541.8992 1578.3960 1600.9917 1619.7792 1687.4222 2973.4285 3067.5640 3134.6100 3136.2259 3138.9401 3151.7376 3159.4441 3164.5080 3181.0100 3181.4697 3184.0138
redmass: 3.8544 4.0887 7.0303 5.9660 5.2427 4.1749 4.4973 1.2851 5.3728 5.0433 7.4707 3.4614 5.5113 6.3851 2.4765 7.7481 5.9596 3.0035 7.8707 4.2677 4.7673 6.6850 6.9231 4.7818 6.3642 6.3185 3.7236 5.8978 7.4660 3.6902 3.3307 4.1409 1.5482 1.6168 1.6798 1.4342 1.2458 5.8213 6.7376 6.8204 1.3241 1.3670 1.4897 3.7213 2.2676 1.6201 3.9380 2.5005 1.2591 1.3393 1.7692 2.1064 1.2620 2.6672 1.8021 1.7892 5.0365 1.5701 2.8083 4.7876 1.8457 1.6551 2.5731 1.9475 1.0494 1.1205 3.4483 7.5231 7.9068 6.5207 7.9949 7.0339 10.5636 1.0324 1.1047 1.0871 1.0902 1.1005 1.0891 1.0961 1.0989 1.0924 1.0955 1.0927
irintensity: 0.0008 0.1871 0.7028 0.1880 9.0611 1.1846 5.6790 0.9293 0.2485 2.1347 0.6887 1.2512 3.0024 3.2553 0.0044 1.5933 10.9484 3.9019 18.8430 3.9765 22.6450 4.1016 16.0882 0.6011 4.2475 4.2527 1.1571 2.8555 14.5155 3.9320 0.0008 5.3905 21.1125 66.2417 47.4825 32.9457 0.1731 35.0097 15.3016 0.4984 0.1824 0.5617 0.0002 78.4159 15.6092 0.2129 77.7490 43.3600 0.0984 9.7457 7.3084 58.9722 1.2211 120.5489 3.7181 69.5841 0.9607 1.1207 159.7045 42.2703 18.1450 18.2419 26.7130 18.8201 15.5576 33.1702 9.2948 13.5721 23.5370 54.5284 29.6211 504.6794 498.5342 56.3594 36.9143 14.9645 7.9464 19.8987 3.4256 25.7110 0.4286 0.2123 2.4261 2.3657
temp: 298.150 k
press: 1.00000 atm
elementType: 8 8 8 7 6 6 6 6 6 6 6 6 6 6 6 6 6 6 6 1 1 1 1 1 1 1 1 1 1 1
symmnumber: 1
zpe: 584701.4 jmol-1
zpe.correction: 0.222701 hartree
zpe.thermalcorrener: 0.237392 hartree
zpe.thermalcorrenthalpy: 0.238336 hartree
zpe.thermalcorrgfe: 0.180557 hartree
zpe.sumelectzpe: -857.288335 hartree
zpe.sumelectthermal: -857.273643 hartree
zpe.sumelectthermalent: -857.272699 hartree
zpe.sumelectthermalfe: -857.330478 hartree
dipole: -2.8896 -3.6656 -0.0051
dipole: 4.6676
quadrupole: -99.0136 -135.1008 -103.0593
quadrupole: 9.2739 -0.0030 -0.0002
quadrupole: 13.3776 -22.7095 9.3319 9.2739 -0.0030 -0.0002
hfenergy: -857.5110355 hartree
pointgroup: C01 [X(C15H11N1O3)]
dipole: 1.150598 1.4312027 -0.0027614 debye
polarizability: 248.043942|10.4063913|202.6878846|-0.0351188|-0.0908508|113.6011367 unknown
InChI: InChI=1S/C15H11NO3/c1-18-11-2-3-12-13(10-4-6-16-7-5-10)9-15(17)19-14(12)8-11/h2-9H,1H3
charge 0 multiplicity 1
30 atoms
O  1.547419 -2.19253 -0.000468
O  4.187398 1.889208 -0.00075
O  0.342265 -4.161938 0.002833
N  -4.603904 1.562556 0.001222
C  0.401479 -0.010107 -0.001264
C  -0.877895 -0.70209 -0.000842
C  1.593205 -0.796053 -0.000639
C  -2.154854 0.083557 -0.00014
C  0.549309 1.410862 -0.001566
C  -0.91815 -2.085115 -0.000715
C  2.878542 -0.217882 -0.000399
C  2.982628 1.190346 -0.000874
C  1.811593 2.006923 -0.001471
C  0.277415 -2.918331 -0.002555
C  -2.779762 0.466216 -1.213529
C  -2.78073 0.462361 1.213954
C  -3.990126 1.194671 -1.162894
C  -3.991034 1.19101 1.164655
C  5.434373 1.108491 -0.000158
H  -0.348199 2.037542 -0.001837
H  -1.868711 -2.623996 0.000478
H  3.74657 -0.880605 0.000033
H  1.936451 3.092836 -0.001753
H  -2.337299 0.197866 -2.178073
H  -2.339027 0.190963 2.177992
H  -4.497251 1.498624 -2.085373
H  -4.498886 1.492058 2.087685
H  5.506211 0.477211 -0.90561
H  5.505697 0.477755 0.905712
H  6.238175 1.85769 -0.000155
