program: Gaussian 09
title: 000013292
version: EM64L-G09RevD.01
frameworkgroup: C1[X(C14H23N3O)]
method: RPBEPBE
basis: SDD
operation: Freq
keyword: #p
keyword: freq=noraman
keyword: PBEPBE/SDD
title: #p freq=noraman PBEPBE/SDD
converged: YES YES NO NO
title: Mulliken charges:
elementType: O N N N C C C C C C C C C C C C C C H H H H H H H H H H H H H H H H H H H H H H H
charge: -0.236981 -0.418285 -0.095727 -0.329955 -0.065023 -0.119268 0.223065 -0.652657 -0.708856 -0.682519 -0.678270 -0.399714 0.443472 -0.452438 -0.342611 -0.221101 -0.223035 -0.238284 0.240882 0.311360 0.157207 0.213820 0.212622 0.210871 0.236670 0.222733 0.203364 0.193387 0.220179 0.217243 0.205116 0.206793 0.231211 0.296543 0.202287 0.230991 0.228954 0.287140 0.222444 0.222364 0.224006
chargesum: 0.00000
title: Mulliken charges with hydrogens summed into heavy atoms:
elementType: O N N N C C C C C C C C C C C C C C
charge: -0.236981 -0.106925 -0.095727 -0.033412 0.175859 0.037938 0.223065 -0.015344 -0.046088 -0.051710 -0.035150 0.033563 0.443472 -0.223484 -0.055470 0.001343 -0.000671 -0.014278
polarizability: 2.40361219e+02 8.45960387e+00 1.86873778e+02 -8.98869501e-01 -1.12997271e+01 1.21525932e+02
1716.lowfreq: -9.3682 -4.7319 -0.0005 -0.0004 0.0005 4.3258 16.9375 22.6685 33.5256
frequency: 16.7547 22.5695 33.4183 37.1118 50.0991 71.2467 77.8125 91.9594 129.2668 140.2372 174.8045 194.8162 200.4573 235.8768 241.4609 254.9315 269.4073 295.4784 325.3690 350.8326 362.2318 374.9015 390.4142 406.0527 424.4436 444.6597 458.3581 486.4392 530.7114 569.2432 594.6596 616.4328 659.3787 677.0321 704.3796 748.1356 780.2142 824.7933 846.7817 858.9439 876.9044 894.6613 914.3535 915.1367 926.3376 938.2549 941.2978 959.5763 981.6670 986.7417 990.4487 1004.8121 1026.8369 1030.2338 1051.6047 1084.3566 1121.2485 1129.6671 1130.9184 1157.8373 1170.3662 1172.1969 1175.2606 1183.7257 1186.3617 1227.2161 1293.8473 1303.0272 1313.7846 1323.2884 1341.8306 1346.7724 1355.8580 1369.9576 1375.6621 1386.4633 1388.2423 1391.5573 1411.7227 1435.5819 1439.7738 1454.8926 1460.5512 1464.3469 1465.6376 1466.1694 1470.4643 1479.7205 1483.8306 1484.4499 1486.0892 1593.9614 1616.3678 1627.4084 2839.5032 2971.6821 2973.4976 2975.8831 2980.1703 2985.1828 3003.1279 3054.7776 3064.2276 3068.6173 3071.1498 3077.4255 3081.4315 3083.4649 3087.6262 3093.1830 3115.4918 3122.5710 3134.8562 3145.4735 3159.7437 3461.1573 3564.8164
redmass: 4.1234 4.1635 3.1928 2.9762 2.6327 3.6693 3.5830 4.2727 3.8958 3.5144 3.7657 1.0410 1.0338 1.2283 1.1382 3.5858 3.0286 2.9980 2.2109 1.8934 2.8785 1.5439 3.1316 2.8425 2.6867 2.6974 2.4710 3.1824 3.6392 3.8072 3.1377 6.2809 5.9372 4.6545 2.0013 1.6603 2.7360 3.9569 2.5860 1.2623 3.0031 2.9794 1.2475 1.2087 1.5164 1.4250 1.4347 2.1925 1.3982 2.1550 2.9977 1.4298 2.1998 3.3496 3.0120 1.5403 1.9489 2.2534 2.2311 2.0981 1.0626 2.0185 1.1822 1.6499 1.3622 2.4062 2.6005 1.4900 1.3115 1.3125 1.2890 1.3786 1.3451 1.2169 1.2176 7.7125 1.2131 1.2304 1.4144 1.2863 2.1642 1.0481 1.0462 1.0559 1.0543 1.0991 1.0585 1.0624 1.1416 2.0366 1.0600 6.1945 6.0040 5.3918 1.0810 1.0353 1.0363 1.0373 1.0352 1.0581 1.0840 1.1062 1.0998 1.0983 1.0990 1.0999 1.0993 1.0997 1.0996 1.1003 1.0854 1.0877 1.0923 1.0968 1.1017 1.0761 1.0755
irintensity: 0.3908 0.8831 0.2375 0.2956 0.4279 0.8173 0.5951 0.8034 1.0268 0.9797 2.3743 0.0812 0.3219 0.1922 0.6072 2.4706 0.7207 5.1673 7.1228 20.4116 5.0260 35.2349 7.1188 0.2959 24.5039 10.2826 31.6030 10.8925 60.9851 8.5314 10.5418 1.0822 6.7874 51.9000 41.3058 71.9968 9.0804 7.4992 3.2225 1.1639 8.0312 11.4880 2.2336 2.6725 1.7035 2.2105 0.7136 15.6002 0.1798 2.2016 0.3377 0.7463 6.5596 33.3148 2.9327 6.5453 16.1840 5.5794 14.4882 9.6384 0.3618 63.2765 18.1320 50.3045 10.1993 7.0116 138.9351 67.4199 8.3053 27.1220 27.6355 50.9639 22.5747 18.3774 17.4669 2.2355 19.4879 46.4356 66.9417 1.3894 11.4617 4.2801 1.6015 4.3394 5.8376 6.0108 8.6643 15.7340 6.3171 14.6069 10.8760 1.0993 0.9124 443.7157 90.7689 33.7697 29.6530 25.0302 30.6637 48.5143 4.8545 17.1666 43.8870 26.4634 39.4384 16.2705 54.0715 66.5756 46.3798 39.5437 4.3752 5.8623 20.2902 23.5431 39.6492 3.2629 11.4207
temp: 298.150 k
press: 1.00000 atm
elementType: 8 7 7 7 6 6 6 6 6 6 6 6 6 6 6 6 6 6 1 1 1 1 1 1 1 1 1 1 1 1 1 1 1 1 1 1 1 1 1 1 1
symmnumber: 1
zpe: 916916.4 jmol-1
zpe.correction: 0.349235 hartree
zpe.thermalcorrener: 0.369798 hartree
zpe.thermalcorrenthalpy: 0.370742 hartree
zpe.thermalcorrgfe: 0.297327 hartree
zpe.sumelectzpe: -785.298475 hartree
zpe.sumelectthermal: -785.277912 hartree
zpe.sumelectthermalent: -785.276968 hartree
zpe.sumelectthermalfe: -785.350383 hartree
dipole: -4.0268 -0.7846 0.9039
dipole: 4.2009
quadrupole: -91.2616 -102.7272 -112.9464
quadrupole: 1.8862 0.5616 -2.9266
quadrupole: 11.0501 -0.4155 -10.6346 1.8862 0.5616 -2.9266
hfenergy: -785.6477102 hartree
pointgroup: C01 [X(C14H23N3O1)]
dipole: -1.500568 0.5788342 -0.3806961 debye
polarizability: 235.8463794|-16.9329866|191.3402123|0.7619996|-11.71464|121.5743366 unknown
InChI: InChI=1S/C14H23N3O/c1-11(2)15-14(16-12(3)4)17-18-10-13-8-6-5-7-9-13/h5-9,11-12,15,17H,10H2,1-4H3
charge 0 multiplicity 1
41 atoms
O  0.49191 1.220269 0.600158
N  -3.092156 0.659242 0.018543
N  -1.182564 -0.856385 -0.013982
N  -0.902287 1.496106 0.258443
C  -3.660049 2.001816 -0.254909
C  -2.033617 -2.029549 -0.330695
C  -1.727506 0.330682 0.104299
C  -4.07536 2.736154 1.045775
C  -4.860559 1.858846 -1.216277
C  -1.176814 -3.053864 -1.102998
C  -2.601024 -2.653239 0.972552
C  1.289256 1.075784 -0.659544
C  2.568219 0.370432 -0.273534
C  3.834809 0.952781 -0.517839
C  2.492219 -0.911792 0.331605
C  5.019143 0.258742 -0.175401
C  3.67376 -1.599427 0.680907
C  4.940257 -1.018517 0.42494
H  -2.870295 2.589389 -0.761841
H  -3.738963 -0.128175 -0.030329
H  -2.897574 -1.752831 -0.989336
H  -4.440551 3.755537 0.820869
H  -4.882714 2.184068 1.561414
H  -3.229763 2.824309 1.752728
H  -4.551544 1.393958 -2.169008
H  -5.301095 2.847018 -1.437474
H  -5.655219 1.234152 -0.762643
H  -1.766616 -3.953705 -1.359912
H  -0.78525 -2.608524 -2.034502
H  -0.312848 -3.359018 -0.48522
H  -3.20863 -3.550544 0.750735
H  -3.229036 -1.934664 1.532466
H  -1.766123 -2.949028 1.63285
H  -1.234367 2.179629 0.951091
H  1.473106 2.077169 -1.094636
H  0.691505 0.463266 -1.358103
H  3.896988 1.948978 -0.973536
H  1.49877 -1.334372 0.522985
H  5.99676 0.714332 -0.370397
H  3.61208 -2.587924 1.150793
H  5.856943 -1.555802 0.694662
