program: Gaussian 09
title: 000162566
version: EM64L-G09RevD.01
frameworkgroup: C1[X(C9H16O)]
method: RPBEPBE
basis: SDD
operation: Freq
keyword: #pfreq=noraman
keyword: PBEPBE/SDD
title: #p freq=noraman PBEPBE/SDD
converged: YES YES NO NO
title: Mulliken charges:
elementType: O C C C C C C C C C H H H H H H H H H H H H H H H H
charge: -0.216289 -0.367544 -0.341190 -0.453398 -0.356422 -0.255188 -0.692630 0.319902 -0.817716 -0.192919 0.210055 0.196573 0.186805 0.192195 0.229573 0.212789 0.198298 0.195751 0.219307 0.218446 0.210736 0.210211 0.225806 0.232029 0.271222 0.163599
chargesum: 0.00000
title: Mulliken charges with hydrogens summed into heavy atoms:
elementType: O C C C C C C C C C
charge: -0.216289 0.039084 0.037810 -0.011036 0.037627 -0.035881 -0.053237 0.319902 -0.088659 -0.029320
polarizability: 1.54528206e+02 -1.44520984e+00 8.94441540e+01 1.05509778e+01 -2.31846051e+00 7.47521158e+01
1716.lowfreq: -0.0008 -0.0006 -0.0004 4.0289 8.4799 13.0477 28.8447 46.7475 60.0810
frequency: 28.8054 46.6967 60.0622 87.1528 97.5615 123.6158 139.5957 191.5467 231.6362 235.1686 270.7392 318.3138 353.7253 433.4539 476.9899 513.7145 643.8040 723.8289 749.4230 804.1064 844.0314 866.2476 890.8812 953.4287 976.3617 996.9102 1000.6228 1039.9978 1043.0079 1072.0365 1076.9716 1107.0314 1132.4975 1195.3107 1222.3529 1243.0538 1260.1654 1285.1607 1288.8886 1298.9958 1335.2520 1351.0612 1356.0375 1386.4825 1390.1082 1401.3382 1454.3387 1463.3526 1466.6035 1470.0784 1477.6006 1479.3597 1487.2952 1488.6641 1599.3363 1648.0306 2862.6825 2950.2385 2955.1795 2966.4522 2973.2012 2973.5787 2983.5269 2995.3216 3016.4438 3031.7877 3047.1684 3062.0021 3065.8751 3070.3008 3073.8935 3094.0743
redmass: 3.5901 1.9614 3.7718 1.0498 2.2107 2.0414 3.1994 3.6114 1.1156 2.8444 3.4548 3.5681 2.5830 2.7199 2.8172 2.8774 3.1786 1.0728 1.1851 1.9191 1.7207 1.3102 1.8887 1.3040 1.5751 3.4602 1.7198 1.9484 2.1444 1.8221 1.9464 2.0770 2.3893 1.6431 1.4441 1.5042 1.2972 1.1495 1.1085 1.2850 1.4268 1.6370 1.6264 1.1730 1.2142 1.4043 1.0944 1.0686 1.0729 1.0731 1.0454 1.0707 1.0749 1.0601 7.7103 7.0224 1.0852 1.0652 1.0589 1.0597 1.0558 1.0403 1.0368 1.0977 1.0995 1.0983 1.0977 1.0922 1.0979 1.1008 1.0993 1.0988
irintensity: 1.2653 0.3311 1.8313 0.4966 0.2129 1.0223 2.6244 4.9225 0.0025 0.4146 8.1344 4.0100 5.2770 5.4740 2.6531 3.6208 3.9314 11.6600 3.4538 17.9014 12.0440 11.8850 4.9321 2.6978 6.2003 1.9607 21.2702 1.8981 3.5370 40.2433 11.4710 10.4959 1.5418 1.6693 20.0980 4.5742 6.7002 0.7864 0.9961 2.0619 0.6489 2.7914 0.5888 17.6509 11.2055 31.1201 7.2891 1.3756 12.4753 9.6022 11.9051 5.0550 29.8254 5.9868 265.2614 59.9767 108.7690 10.1201 9.2929 3.2447 112.9176 26.2647 15.9675 1.9918 2.6223 18.4470 27.6543 49.8854 19.3100 102.6087 52.2237 4.0900
temp: 298.150 k
press: 1.00000 atm
elementType: 8 6 6 6 6 6 6 6 6 6 1 1 1 1 1 1 1 1 1 1 1 1 1 1 1 1
symmnumber: 1
zpe: 596341.8 jmol-1
zpe.correction: 0.227135 hartree
zpe.thermalcorrener: 0.240009 hartree
zpe.thermalcorrenthalpy: 0.240953 hartree
zpe.thermalcorrgfe: 0.186334 hartree
zpe.sumelectzpe: -426.949679 hartree
zpe.sumelectthermal: -426.936805 hartree
zpe.sumelectthermalent: -426.935860 hartree
zpe.sumelectthermalfe: -426.990480 hartree
dipole: 4.5565 0.0667 1.0357
dipole: 4.6732
quadrupole: -88.7269 -59.7377 -63.1218
quadrupole: -1.6579 -3.7466 -1.3197
quadrupole: -18.1981 10.7911 7.4070 -1.6579 -3.7466 -1.3197
hfenergy: -427.1768138 hartree
pointgroup: C01 [X(C9H16O1)]
dipole: -1.7903258 0.3254239 0.2629942 debye
dipolederiv: -1.2253743 0.122685 0.151505 0.2520627 -0.4420835 0.0007526 0.0885767 0.0346957 -0.4016128 0.0631877 -0.0204292 0.0127099 -0.0704508 0.1828987 -0.0017694 0.2092823 -0.0321874 0.0839612 -0.0377034 -0.026662 -0.0202829 -0.017259 0.1800385 0.0027222 -0.1428004 0.0109909 0.0709624 -0.3821856 -0.003936 0.0314708 0.074472 0.1200982 0.0084933 -0.0020424 0.0336751 0.0485769 -0.0011823 -0.0146589 0.0044077 -0.0163458 0.1708759 -0.0014813 0.1024803 -0.0050196 0.1040904 0.6229311 -0.0718301 -0.1921834 -0.1957019 -0.0376211 -0.0671456 -0.2803784 -0.0986684 -0.076931 -0.0848627 -0.018124 0.0285811 -0.0220106 0.0934011 0.0038947 -0.0348018 0.0032735 0.056308 -0.9297938 0.0317557 0.2026081 -0.0677988 0.1012068 -0.1146737 0.4112692 -0.144584 -0.0113311 0.0100436 -0.0420033 0.0608736 0.0392446 -0.0667777 0.1084948 -0.0054461 0.1424165 -0.0411885 1.5336735 -0.2108415 -0.2555352 0.0239823 0.4154416 -0.2324638 -0.4937608 -0.1753926 0.4059103 0.0358655 0.0224689 0.0187873 0.0196562 -0.0692873 -0.1227458 0.0061601 -0.0983073 -0.0303675 0.0466379 -0.0076598 -0.0079468 -0.0004817 -0.0860121 0.1348373 0.00094 0.1090909 -0.0362288 0.0243025 0.022688 0.0199346 0.029028 -0.0882404 -0.1399619 0.0266006 -0.1145532 -0.0436687 0.0409813 0.0084539 -0.0153923 -0.0031629 -0.0855114 0.1371174 0.0024168 0.1131177 -0.0445381 0.0410329 -0.0031661 -0.0083124 -0.0344317 -0.0539416 0.1192589 -0.0176936 0.0843393 -0.0115967 0.0207018 0.0642438 0.0544803 -0.0121401 -0.0389176 -0.1089824 0.0717596 -0.1007222 0.0016189 0.0200109 0.0531792 0.0496789 0.0330163 -0.0802464 -0.142282 0.0186177 -0.1135348 -0.0380692 0.031842 -0.026925 0.0135759 -0.0044545 -0.0928843 0.1521693 -0.0095275 0.1181984 -0.0429107 0.0549331 0.0038389 0.0227687 0.0025192 -0.0217978 0.1287966 0.0471449 0.1382789 0.0092121 -0.1530608 -0.0271052 -0.1123483 -0.033092 0.097281 -0.0151849 -0.149022 -0.0191488 -0.0246148 0.0764058 0.027682 -0.0065794 -0.0222978 -0.086593 0.1346786 0.046668 0.1291699 -0.0113973 0.0676041 0.0107007 0.0270473 0.0632827 -0.0849429 -0.1313629 0.0759536 -0.1155832 -0.0072795 0.0014476 -0.1340669 -0.0385399 -0.0822936 -0.0311494 0.004099 -0.0438003 -0.0207177 0.0675204 0.1125327 0.0195916 0.0527196 0.0166263 0.0455763 -0.0580557 0.0077546 -0.0143993 -0.1129594 -0.0268013 0.1211909 -0.0391753 0.0278163 0.1004892 0.0027216 0.0396948 -0.0341597 0.1313912 0.0368302 0.0989295 -0.0548529 0.0002146 -0.1413006 0.1980729 0.0239541 0.1697312 -0.0448579 unknown
polarizability: 154.3266128|-10.1037252|83.3168311|-5.0368888|-7.6561571|81.0810319 unknown
InChI: InChI=1S/C9H16O/c1-3-4-5-6-7-9(2)8-10/h7-8H,3-6H2,1-2H3
charge 0 multiplicity 1
26 atoms
O  4.587438 -0.183842 -0.591245
C  -1.382172 0.253053 -0.394404
C  -2.755459 0.082593 0.292606
C  -0.218844 0.401422 0.627453
C  -3.920149 -0.071391 -0.712503
C  1.110418 0.644309 -0.037452
C  -5.290607 -0.236335 -0.020711
C  2.267835 -0.070931 0.148019
C  2.430004 -1.25207 1.083809
C  3.449736 0.361523 -0.638496
H  -1.181944 -0.617208 -1.050567
H  -1.407458 1.145037 -1.053731
H  -2.950641 0.957773 0.947393
H  -2.727794 -0.804613 0.958913
H  -0.176018 -0.490835 1.278712
H  -0.453567 1.265024 1.28752
H  -3.725115 -0.946807 -1.364791
H  -3.944744 0.81427 -1.379652
H  1.137977 1.484198 -0.753349
H  -6.106113 -0.345138 -0.758897
H  -5.301476 -1.131554 0.629346
H  -5.52309 0.640391 0.612913
H  1.705024 -2.055527 0.858912
H  2.282952 -0.956963 2.139029
H  3.4489 -1.661662 0.980499
H  3.265508 1.240282 -1.309726
