program: Gaussian 09
title: 000162511
version: EM64L-G09RevD.01
frameworkgroup: C1[X(C11H16O)]
method: RPBEPBE
basis: SDD
operation: Freq
keyword: #pfreq=noraman
keyword: PBEPBE/SDD
title: #p freq=noraman PBEPBE/SDD
converged: YES YES NO NO
title: Mulliken charges:
elementType: O C C C C C C C C C C C H H H H H H H H H H H H H H H H
charge: -0.213841 0.306054 -0.250719 -0.227668 -0.246604 -0.559991 -0.235071 -0.234590 -0.764914 -0.757454 0.184470 -0.791402 0.245781 0.231020 0.261684 0.248278 0.258353 0.241528 0.240698 0.213378 0.206234 0.240919 0.208742 0.215642 0.250014 0.241558 0.233830 0.254069
chargesum: 0.00000
title: Mulliken charges with hydrogens summed into heavy atoms:
elementType: O C C C C C C C C C C C
charge: -0.213841 0.306054 -0.004938 0.003352 0.015080 -0.053359 0.006457 0.006109 -0.104383 -0.083055 0.184470 -0.061946
polarizability: 1.23673121e+02 -1.73649778e+00 1.09932650e+02 3.85402578e-01 7.29852109e-01 1.02327261e+02
1716.lowfreq: -15.7230 -13.2374 -0.0006 -0.0005 -0.0001 13.0297 48.3552 98.3672 101.9947
frequency: 48.3218 98.2588 101.9538 151.1948 196.6489 215.5569 234.5869 268.9841 292.1965 329.2271 362.1509 364.3995 421.9108 481.5270 489.0892 548.5355 584.9401 610.0133 710.6253 735.2547 746.0407 793.6386 850.7485 877.0029 901.3615 913.9733 919.7035 928.9880 938.9030 950.1190 964.3692 974.4190 993.0962 1003.2346 1017.5688 1035.3023 1088.0732 1093.1659 1118.8630 1138.1182 1169.5628 1175.4929 1209.2590 1226.1483 1239.7414 1244.5979 1261.4469 1274.7233 1315.7904 1327.7555 1362.2910 1378.6929 1398.3033 1440.6624 1450.2839 1465.4195 1469.2189 1476.6349 1487.1193 1490.8807 1576.8460 1621.6584 2967.1457 2976.1145 2976.3017 3006.9844 3034.5867 3052.5280 3057.9481 3060.1762 3065.7156 3079.4336 3091.7600 3093.9524 3112.0585 3118.6012 3150.7314 3184.1003
redmass: 4.1074 1.0425 3.1299 3.8814 1.4250 1.8264 2.0783 1.2019 3.4712 3.4011 2.4797 2.7156 2.7785 2.0355 3.0250 3.1091 2.9166 3.0037 1.9191 2.6266 3.6960 4.0764 2.7645 2.7963 2.6205 2.1079 1.6834 2.2723 1.4572 1.9899 1.9563 1.9808 1.4967 1.5082 1.5879 1.5566 1.2036 1.2324 1.7489 1.6942 2.1219 2.2272 2.3024 1.8323 1.5092 1.6409 1.4066 1.6728 1.7315 1.7067 1.2499 1.2003 1.1982 1.0712 1.0546 1.0572 1.0495 1.0709 1.0572 1.0743 5.6738 7.2059 1.0360 1.0373 1.0376 1.0846 1.0611 1.0987 1.0966 1.0959 1.0897 1.0988 1.0907 1.0992 1.1046 1.1003 1.0871 1.1096
irintensity: 4.0470 0.6460 1.5642 0.8927 1.2436 1.5276 0.1783 0.0579 1.1757 3.0255 0.2116 0.1644 2.9429 0.9332 1.2744 1.8937 9.7098 5.0609 37.9427 19.0804 4.0867 3.4575 6.3052 6.7081 0.6065 6.4692 2.5007 2.0733 1.4081 8.0825 9.3291 4.0434 0.4507 6.7920 2.3007 3.2692 1.3544 4.3389 14.9873 2.3169 38.3584 17.2034 16.0319 29.7982 9.1482 9.6988 3.0440 13.1836 7.0811 60.4323 60.5902 23.1687 15.9054 17.1251 16.3145 5.8812 0.6405 8.0836 22.5282 14.5507 2.4673 100.8312 29.7938 3.5527 36.5181 26.3095 25.7289 7.7395 27.8469 14.2004 69.5043 28.6674 16.5384 28.3526 20.8226 17.7841 7.3097 21.9709
temp: 298.150 k
press: 1.00000 atm
elementType: 8 6 6 6 6 6 6 6 6 6 6 6 1 1 1 1 1 1 1 1 1 1 1 1 1 1 1 1
symmnumber: 1
zpe: 631525.0 jmol-1
zpe.correction: 0.240535 hartree
zpe.thermalcorrener: 0.252504 hartree
zpe.thermalcorrenthalpy: 0.253448 hartree
zpe.thermalcorrgfe: 0.203264 hartree
zpe.sumelectzpe: -503.029427 hartree
zpe.sumelectthermal: -503.017459 hartree
zpe.sumelectthermalent: -503.016514 hartree
zpe.sumelectthermalfe: -503.066699 hartree
dipole: -0.7568 2.0740 -2.0373
dipole: 3.0042
quadrupole: -74.8220 -74.7552 -72.4253
quadrupole: 2.8071 -4.8244 3.8651
quadrupole: -0.8212 -0.7544 1.5755 2.8071 -4.8244 3.8651
hfenergy: -503.2699627 hartree
pointgroup: C01 [X(C11H16O1)]
dipole: 0.3252692 0.7926933 0.8141342 debye
polarizability: 123.7032084|1.6181927|109.9429927|-0.1526961|-0.5766765|102.286831 unknown
InChI: InChI=1S/C11H16O/c1-7(12)10-8-4-5-9(6-8)11(10,2)3/h4-5,8-10H,6H2,1-3H3
charge 0 multiplicity 1
28 atoms
O  -2.211332 -1.181586 -0.814079
C  0.23631 1.048593 -0.169555
C  1.544103 0.362226 -0.783232
C  -0.438618 -0.214635 0.572245
C  0.527725 -1.415815 0.199276
C  0.973051 -1.016387 -1.240169
C  2.438373 -0.086614 0.378772
C  1.825528 -1.153842 0.971696
C  0.565288 2.17188 0.841394
C  -0.625152 1.648315 -1.31347
C  -1.892903 -0.461922 0.173024
C  -2.958177 0.196816 1.044562
H  2.02492 0.991002 -1.549902
H  -0.41577 -0.026249 1.66229
H  0.066025 -2.406637 0.320177
H  1.756665 -1.684978 -1.634406
H  0.132776 -0.96191 -1.949527
H  3.347472 0.424485 0.707149
H  2.131946 -1.679873 1.880222
H  1.119225 2.993723 0.348242
H  -0.36126 2.60448 1.266222
H  1.180581 1.794584 1.676379
H  -1.543425 2.123963 -0.91947
H  -0.048853 2.433286 -1.838275
H  -0.93207 0.893733 -2.055455
H  -2.986472 -0.299978 2.034297
H  -2.716477 1.260229 1.2293
H  -3.949479 0.11071 0.572794
