program: Gaussian 09
title: 000162451
version: EM64L-G09RevD.01
frameworkgroup: C1[X(C15H12O)]
method: RPBEPBE
basis: SDD
operation: Freq
keyword: #pfreq=noraman
keyword: PBEPBE/SDD
title: #p freq=noraman PBEPBE/SDD
converged: NO YES NO YES
title: Mulliken charges:
elementType: O C C C C C C C C C C C C C C C H H H H H H H H H H H H
charge: -0.176457 0.322221 0.322223 0.014743 0.014744 -0.314294 0.334164 0.334163 -0.430833 -0.430833 -0.440187 -0.440188 -0.212302 -0.212303 -0.781416 -0.781417 0.248442 0.248441 0.237247 0.237247 0.229101 0.229101 0.252141 0.252148 0.219908 0.219908 0.252142 0.252147
chargesum: 0.00000
title: Mulliken charges with hydrogens summed into heavy atoms:
elementType: O C C C C C C C C C C C C C C C
charge: -0.176457 0.322221 0.322223 0.014743 0.014744 -0.314294 0.334164 0.334163 -0.182392 -0.182392 -0.202941 -0.202941 0.016799 0.016798 -0.057220 -0.057220
polarizability: 2.51991603e+02 -1.99908755e-05 1.89661530e+02 1.17332052e-03 3.85898560e-03 7.12810686e+01
1716.lowfreq: -7.4999 -0.0007 -0.0005 0.0004 4.8435 7.2424 75.3185 80.8604 97.2111
frequency: 75.2750 80.8551 97.1861 103.5397 143.0422 160.9262 214.0654 226.1619 256.1954 277.1852 304.9049 337.5810 434.5566 441.1569 471.3682 496.0553 509.8162 511.9269 564.5334 606.0182 606.9507 655.7721 677.4771 753.2363 760.0394 787.4284 789.5758 822.5660 849.9978 898.3711 909.0735 915.0249 925.5544 985.0900 987.1940 991.6914 1015.3651 1040.3826 1042.6911 1061.5268 1074.6847 1142.9901 1150.5951 1171.9197 1185.0315 1209.6955 1248.6140 1262.0162 1292.4287 1363.2171 1388.6375 1402.3860 1403.0667 1415.1901 1440.4399 1456.7936 1457.0751 1458.9206 1466.7123 1475.9010 1486.1325 1575.9540 1600.6445 1610.8677 1614.2644 1623.2613 2988.4291 2988.4923 3069.0791 3069.4628 3092.2707 3092.6086 3124.1052 3124.8433 3137.3514 3139.7251 3156.3707 3157.9594
redmass: 2.0330 4.6099 1.1289 1.3040 4.6080 3.6578 3.1891 3.0057 4.6567 4.9931 3.8447 4.6343 4.4022 5.1995 4.1946 3.3141 4.7358 3.4650 6.2515 3.4774 6.6738 6.6426 3.7519 1.6749 6.5092 1.2606 5.9509 2.1794 6.8645 5.4909 1.3373 1.5085 2.7326 1.3716 1.3562 1.6296 2.3250 1.5740 1.6065 2.1164 1.9240 2.8638 2.0660 1.3934 1.2481 4.9629 1.9760 1.7801 3.0702 5.9448 2.7139 1.2610 1.3139 2.0538 2.4303 1.0444 1.0444 2.2597 1.2524 2.3646 1.7994 9.0548 8.1514 7.3356 6.7499 9.5352 1.0365 1.0365 1.0959 1.0959 1.1012 1.1012 1.0858 1.0860 1.0919 1.0920 1.0992 1.0991
irintensity: 0.0000 4.7004 2.5586 0.0000 0.0678 0.3974 2.2274 0.0000 5.1666 0.0000 0.0972 0.0992 3.3726 0.1593 2.0731 0.0000 1.9581 2.0253 0.0007 0.0000 0.0060 4.3854 12.6036 0.0000 0.7312 118.5225 16.7717 0.0000 0.9981 29.7240 1.8225 0.0000 3.0742 0.0000 1.2744 1.6875 0.4018 0.0000 20.4842 4.3397 1.0354 10.2900 20.3970 16.9583 0.1286 57.4000 0.0764 26.0518 1.6830 0.7831 0.2599 51.2612 2.4769 1.6427 1.2254 0.0000 26.9576 1.4769 14.7560 54.7224 3.6108 121.6623 144.3341 1.0171 26.2617 91.8766 14.9301 17.1130 0.0001 18.6814 57.7668 1.3631 0.0084 4.2454 27.8391 7.1895 39.7271 28.6034
temp: 298.150 k
press: 1.00000 atm
elementType: 8 6 6 6 6 6 6 6 6 6 6 6 6 6 6 6 1 1 1 1 1 1 1 1 1 1 1 1
symmnumber: 1
zpe: 579623.6 jmol-1
zpe.correction: 0.220767 hartree
zpe.thermalcorrener: 0.234068 hartree
zpe.thermalcorrenthalpy: 0.235012 hartree
zpe.thermalcorrgfe: 0.181124 hartree
zpe.sumelectzpe: -652.951731 hartree
zpe.sumelectthermal: -652.938430 hartree
zpe.sumelectthermalent: -652.937486 hartree
zpe.sumelectthermalfe: -652.991373 hartree
dipole: 0.0000 -2.6149 -0.0001
dipole: 2.6149
quadrupole: -75.2093 -89.3680 -97.2477
quadrupole: 0.0000 0.0001 0.0001
quadrupole: 12.0657 -2.0930 -9.9727 0.0000 0.0001 0.0001
hfenergy: -653.1724978 hartree
pointgroup: C01 [X(C15H12O1)]
dipole: -0.0000011 1.0287722 -0.0000424 debye
polarizability: 251.9916027|-0.0000742|189.6615296|-0.0011733|-0.003859|71.2810686 unknown
InChI: InChI=1S/C15H12O/c1-9-5-3-7-11-12-8-4-6-10(2)14(12)15(16)13(9)11/h3-8H,1-2H3
charge 0 multiplicity 1
28 atoms
O  -0.000008 -2.547499 0.000274
C  0.743793 0.981729 0.000124
C  -0.743806 0.981729 0.00014
C  1.200044 -0.371309 0.000162
C  -1.200059 -0.371307 0.000198
C  -0.000008 -1.279924 0.000171
C  2.57419 -0.703526 0.000181
C  -2.574205 -0.703522 0.000222
C  1.661331 2.044529 0.000095
C  -1.661341 2.044529 0.000121
C  3.491692 0.38762 0.000147
C  -3.491707 0.387626 0.000202
C  3.04624 1.729057 0.000102
C  -3.046252 1.729063 0.000149
C  3.0600 -2.138162 0.000215
C  -3.060018 -2.138157 0.00026
H  1.330255 3.088482 0.000058
H  -1.330264 3.088482 0.000083
H  4.567419 0.176376 0.00016
H  -4.567434 0.176384 0.000229
H  3.784889 2.538834 0.000083
H  -3.784899 2.538842 0.000141
H  2.677756 -2.687139 0.879533
H  2.677581 -2.68725 -0.878956
H  4.162306 -2.185707 0.00011
H  -4.162323 -2.185703 0.000321
H  -2.677738 -2.687193 -0.879006
H  -2.677634 -2.687186 0.879483
