program: Gaussian 09
title: 000162424
version: EM64L-G09RevD.01
frameworkgroup: C1[X(C11H15NO2)]
method: RPBEPBE
basis: SDD
operation: Freq
keyword: #p
keyword: freq=noraman
keyword: PBEPBE/SDD
title: #p freq=noraman PBEPBE/SDD
converged: YES YES NO NO
title: Mulliken charges:
elementType: O O N C C C C C C C C C C C H H H H H H H H H H H H H H H
charge: -0.270761 -0.265419 -0.605281 -0.350729 -0.580641 -0.037074 0.557342 -0.526406 -0.719460 0.197986 -0.419282 0.160572 -0.333064 -0.204552 0.220144 0.195203 0.206648 0.200428 0.181795 0.256440 0.230720 0.205477 0.212567 0.239207 0.247151 0.268255 0.264575 0.238964 0.229194
chargesum: 0.00000
title: Mulliken charges with hydrogens summed into heavy atoms:
elementType: O O N C C C C C C C C C C C
charge: -0.270761 -0.265419 -0.072451 0.064619 -0.173565 0.144721 0.557342 -0.269966 -0.070696 0.197986 -0.180075 0.160572 -0.085913 0.263606
polarizability: 1.85285790e+02 -9.56985325e+00 1.21958673e+02 9.11350416e+00 6.77032522e+00 8.76065129e+01
1716.lowfreq: -7.1153 -4.8707 -0.0009 -0.0006 0.0003 4.9859 20.5812 44.8478 52.2551
frequency: 20.2198 44.8373 52.2341 84.7929 102.6402 166.6529 198.0760 213.2689 228.6493 251.1498 283.4854 313.3622 385.4572 411.3653 421.8137 431.2216 469.5574 513.9574 593.0809 609.8291 624.6763 676.4099 715.9003 746.0492 775.2403 779.9233 812.8188 837.0389 847.0765 876.4089 907.6166 932.2028 944.3241 961.1809 976.0959 998.0740 1038.5610 1055.9055 1070.9175 1082.2154 1127.3377 1131.5204 1152.2869 1169.1191 1185.0273 1224.9771 1247.1936 1261.2412 1266.3614 1286.0859 1323.6936 1346.0011 1362.9021 1368.1921 1381.2634 1398.1615 1438.9698 1445.5037 1468.6594 1474.4042 1477.0243 1482.9521 1485.5330 1611.4420 1629.8938 1642.7448 2839.9194 2968.5736 2973.9869 2981.3791 2992.4418 3022.2502 3053.8808 3065.9923 3087.4514 3105.3765 3136.9242 3159.5127 3178.6753 3452.2291 3576.6098
redmass: 3.6415 3.5914 3.7472 2.5967 2.3613 4.5141 3.5000 1.1225 5.0482 1.1011 2.8193 4.3814 3.1717 3.4819 3.0255 3.1034 2.1372 4.9379 5.2041 1.3610 4.2049 9.0104 4.3717 4.5352 2.4501 1.9415 1.4475 4.8926 2.5359 1.6017 2.9570 1.4030 1.7524 1.5704 4.0690 1.8233 3.0838 3.4323 1.5003 1.6598 1.1330 1.3108 2.3224 1.3895 1.6386 1.3393 2.9598 1.4567 1.3671 1.2560 1.4125 1.3314 1.2643 1.7616 1.2285 3.8899 4.4422 1.0901 1.0530 1.9163 1.0614 1.1861 1.3357 7.7950 7.5971 1.1111 1.0816 1.0590 1.0372 1.0595 1.0617 1.0988 1.1039 1.0981 1.1000 1.1092 1.0898 1.0928 1.0956 1.0450 1.0970
irintensity: 0.2424 0.8069 2.2742 16.6818 4.5977 0.6605 3.2189 25.6966 2.0384 48.9089 1.1210 0.4123 0.9052 8.7206 3.6347 4.6598 19.5822 2.9535 2.5473 169.5449 10.9013 0.2271 3.4154 3.5119 13.3704 10.7628 41.8550 29.9246 3.5540 22.2977 3.7063 0.7853 1.0799 8.6572 133.5451 0.7235 6.4096 11.2471 6.6766 7.6372 2.2252 7.8728 27.9365 10.7964 42.6881 11.5611 147.0309 20.5924 2.3940 1.5585 4.0091 29.0841 0.6136 13.1772 22.5972 11.2513 43.4469 2.5301 6.8095 104.3022 11.6214 23.4298 34.2184 6.0146 2.7915 65.8025 97.4680 24.1184 37.9921 45.6971 128.2956 4.5873 39.0915 49.7176 39.5315 33.8031 10.8413 4.6060 5.1481 2.2549 0.2958
temp: 298.150 k
press: 1.00000 atm
elementType: 8 8 7 6 6 6 6 6 6 6 6 6 6 6 1 1 1 1 1 1 1 1 1 1 1 1 1 1 1
symmnumber: 1
zpe: 630659.2 jmol-1
zpe.correction: 0.240205 hartree
zpe.thermalcorrener: 0.254204 hartree
zpe.thermalcorrenthalpy: 0.255148 hartree
zpe.thermalcorrgfe: 0.197851 hartree
zpe.sumelectzpe: -632.273072 hartree
zpe.sumelectthermal: -632.259073 hartree
zpe.sumelectthermalent: -632.258129 hartree
zpe.sumelectthermalfe: -632.315427 hartree
dipole: -1.0654 -0.8417 -0.5405
dipole: 1.4614
quadrupole: -72.1421 -83.3290 -84.6341
quadrupole: -1.9102 7.1865 -1.8690
quadrupole: 7.8929 -3.2939 -4.5990 -1.9102 7.1865 -1.8690
hfenergy: -632.5132772 hartree
pointgroup: C01 [X(C11H15N1O2)]
dipole: -0.4198345 -0.3457883 -0.1863564 debye
polarizability: 185.2705413|-8.9408001|122.8203312|9.7596173|4.0555427|86.7601034 unknown
InChI: InChI=1S/C11H15NO2/c1-8(12)2-3-9-4-5-10-11(6-9)14-7-13-10/h4-6,8H,2-3,7,12H2,1H3
charge 0 multiplicity 1
29 atoms
O  3.017073 -1.582056 -0.338451
O  3.87695 0.507139 0.467893
N  -4.66864 0.741208 -0.494148
C  -2.546126 -0.260428 0.318809
C  -1.692356 0.231992 -0.88273
C  -4.030126 -0.516508 -0.036715
C  -0.215556 0.362278 -0.535917
C  0.644433 -0.77219 -0.65088
C  -4.802911 -1.040528 1.190042
C  1.977831 -0.614876 -0.271189
C  0.306737 1.591405 -0.057465
C  2.483325 0.613405 0.20464
C  1.670263 1.742046 0.32021
C  4.179822 -0.940892 0.330545
H  -2.503183 0.490414 1.131053
H  -2.106498 -1.200208 0.709317
H  -2.075846 1.215069 -1.217744
H  -1.821827 -0.477768 -1.725159
H  -4.051942 -1.314114 -0.824252
H  0.272516 -1.729957 -1.02737
H  -4.785327 -0.285481 1.996696
H  -5.860414 -1.251786 0.938684
H  -4.353401 -1.975596 1.569752
H  -0.36221 2.455485 0.025514
H  2.065854 2.695707 0.678887
H  -5.692338 0.694278 -0.526667
H  -4.282435 1.123134 -1.363268
H  5.070643 -1.062619 -0.304558
H  4.302789 -1.381952 1.338568
