program: Gaussian 09
title: 000162407
version: EM64L-G09RevD.01
frameworkgroup: C1[X(C18H19N3)]
method: RPBEPBE
basis: SDD
operation: Freq
keyword: #pfreq=noraman
keyword: PBEPBE/SDD
title: #p freq=noraman PBEPBE/SDD
converged: YES YES NO NO
title: Mulliken charges:
elementType: N N N C C C C C C C C C C C C C C C C C C H H H H H H H H H H H H H H H H H H H
charge: -0.464765 -0.090619 0.002777 0.160566 0.153577 -0.697633 -0.712229 -0.695255 0.196003 -0.008066 0.293924 0.292366 -0.423263 -0.395965 -0.321322 -0.494074 -0.234189 -0.223866 -0.244286 -0.202970 -0.361911 0.198229 0.222367 0.236884 0.233234 0.228028 0.186175 0.219534 0.235237 0.200420 0.314617 0.235452 0.261027 0.276139 0.264365 0.228092 0.233057 0.232716 0.226453 0.239174
chargesum: 0.00000
title: Mulliken charges with hydrogens summed into heavy atoms:
elementType: N N N C C C C C C C C C C C C C C C C C C
charge: -0.150148 -0.090619 0.002777 0.160566 0.153577 -0.040154 -0.064792 -0.040063 0.196003 -0.008066 0.293924 0.292366 -0.187810 -0.134938 -0.045183 -0.229709 -0.006097 0.009190 -0.011570 0.023483 -0.122738
polarizability: 2.68269636e+02 5.14698568e+00 2.76283633e+02 -4.49350350e+00 1.69449104e+01 1.29363155e+02
1716.lowfreq: -11.1757 -6.1121 0.0003 0.0005 0.0007 1.8377 7.5129 31.6479 44.8985
frequency: -9.6008 31.5600 44.8883 56.2584 70.4947 83.9571 123.7860 139.0579 180.6618 199.0664 238.6594 241.9265 247.3390 257.3788 270.2257 291.3058 300.6983 341.8338 354.6486 395.3565 405.8187 416.6628 428.0725 457.7882 494.9668 533.7593 582.9547 598.5907 612.1984 616.0428 667.7612 677.6695 702.9827 712.8779 720.7665 725.0422 731.3548 774.6132 822.9486 824.3811 853.6719 919.7977 920.7398 926.0875 931.9877 943.7866 947.2886 947.5299 978.4918 980.5701 987.9048 993.1680 998.8495 1003.2964 1019.8191 1020.3736 1025.7087 1033.2805 1077.3713 1081.3870 1107.1845 1152.6514 1174.4121 1182.5719 1192.0700 1202.8877 1206.1329 1226.2279 1247.4434 1279.0563 1307.9784 1316.6509 1335.6160 1352.9562 1371.3647 1374.9988 1379.1922 1387.5814 1403.7401 1412.9410 1435.9975 1449.3702 1453.4901 1462.4063 1464.9837 1474.5028 1480.0399 1485.4079 1491.6312 1522.1435 1542.1394 1563.8891 1581.5768 1592.5113 1614.5288 2969.3405 2973.4650 2990.0840 3059.3017 3067.7514 3081.8685 3084.1793 3089.0531 3104.3741 3116.1860 3128.2151 3131.4679 3140.2189 3142.9249 3150.9592 3154.8316 3168.5643 3171.4259 3580.6969
redmass: 2.8060 4.1015 4.4971 4.2935 4.9420 4.0564 5.1589 3.7614 1.9287 1.3775 3.7351 3.9682 1.2928 1.7248 1.3391 3.5967 3.7577 2.8045 2.9663 3.1076 2.8514 3.6663 3.9157 3.9043 3.7735 4.8147 3.6230 4.6395 7.2620 6.4202 1.1567 6.3944 1.8058 5.4296 2.0227 6.2694 8.0969 1.9730 2.1842 2.0602 1.2472 1.7198 1.4058 1.3763 1.6933 1.5047 4.1851 1.3625 2.1234 2.5584 4.8820 1.3946 1.3343 4.0666 1.4951 3.2658 1.4400 2.1055 2.3499 1.6892 1.7849 1.9897 1.0552 2.4801 1.1194 1.5892 2.8327 3.4024 3.0548 2.7353 9.6748 1.5171 1.4303 3.1844 1.2026 6.0352 1.2990 2.4129 1.2808 2.2382 2.3557 2.1697 1.0506 1.0495 1.0505 1.0673 1.4427 1.1793 1.8196 2.8073 5.5166 6.1482 5.9436 6.2696 6.1751 1.0363 1.0353 1.0361 1.0975 1.0992 1.1009 1.1002 1.0996 1.0993 1.0875 1.0874 1.0865 1.0916 1.0920 1.0929 1.0957 1.1013 1.0988 1.0807
irintensity: 0.0297 1.4340 0.4783 0.5815 0.3677 0.2013 5.0606 0.3923 1.7294 1.0742 1.7233 0.6327 0.3381 0.8396 0.4229 3.0415 0.1364 1.5739 0.7061 2.2087 0.0409 1.7858 1.9257 0.3766 3.1440 2.4024 3.4562 9.5006 3.4746 0.2080 74.7787 10.9995 49.9427 9.8263 22.5358 4.3329 1.2128 53.5869 24.6271 18.5443 0.3288 3.1261 4.7862 0.8608 0.6176 3.0741 17.0029 3.8038 7.8996 8.3823 0.0520 0.7708 0.2413 4.4334 0.3474 2.0957 0.5145 2.8220 5.6726 7.4611 15.4185 4.1766 0.1047 7.8111 0.1509 3.9284 8.3634 19.8897 19.7400 99.0979 0.6014 2.1710 2.3621 2.1491 17.8303 2.6312 17.7165 16.0800 6.6681 11.6754 11.4232 11.5263 0.5716 0.2490 1.4400 16.4745 4.7977 35.8496 20.2047 104.2249 1.1583 0.6499 5.2149 10.4615 22.3982 25.0981 35.8445 32.5331 19.4317 64.0873 7.2886 8.2997 93.0356 26.8309 9.3178 9.7899 0.5961 21.3454 21.5785 25.3036 27.9577 19.1195 14.5444 30.4103
temp: 298.150 k
press: 1.00000 atm
elementType: 7 7 7 6 6 6 6 6 6 6 6 6 6 6 6 6 6 6 6 6 6 1 1 1 1 1 1 1 1 1 1 1 1 1 1 1 1 1 1 1
symmnumber: 1
zpe: 858324.5 jmol-1
zpe.correction: 0.326919 hartree
zpe.thermalcorrener: 0.345027 hartree
zpe.thermalcorrenthalpy: 0.345971 hartree
zpe.thermalcorrgfe: 0.280493 hartree
zpe.sumelectzpe: -860.090350 hartree
zpe.sumelectthermal: -860.072242 hartree
zpe.sumelectthermalent: -860.071298 hartree
zpe.sumelectthermalfe: -860.136776 hartree
dipole: 3.3095 -3.6003 1.1692
dipole: 5.0281
quadrupole: -121.2783 -110.6052 -126.5675
quadrupole: 1.9364 -5.8181 6.9861
quadrupole: -1.7946 8.8785 -7.0839 1.9364 -5.8181 6.9861
hfenergy: -860.417269 hartree
pointgroup: C01 [X(C18H19N3)]
dipole: -1.3890407 -1.366693 -0.3406287 debye
polarizability: 265.8661827|-6.2743339|276.7491218|-17.4601609|-15.8170611|131.3011195 unknown
InChI: InChI=1S/C18H19N3/c1-18(2,3)17-20-15(13-8-5-4-6-9-13)16(21-17)14-10-7-11-19-12-14/h4-12,20H,1-3H3
charge 0 multiplicity 1
40 atoms
N  -1.479062 -1.12144 0.207399
N  -1.5085 1.118968 0.184915
N  3.258217 2.314717 0.422897
C  -3.796538 -0.027781 0.347869
C  -2.279583 0.017555 0.264922
C  -4.323274 1.370429 0.758075
C  -4.248572 -1.084516 1.396766
C  -4.370337 -0.405972 -1.053089
C  -0.133104 -0.736839 0.068286
C  -0.170772 0.676503 0.06999
C  0.923075 -1.753055 -0.091438
C  0.912827 1.673916 0.031566
C  0.885142 -2.961288 0.66219
C  1.974441 -1.575414 -1.033403
C  0.626106 3.00409 -0.383565
C  2.248283 1.398328 0.44357
C  1.867745 -3.958236 0.479802
C  2.960144 -2.568222 -1.206776
C  2.911446 -3.76608 -0.454415
C  1.65743 3.963942 -0.403986
C  2.958514 3.577445 -0.006211
H  -5.428466 1.357844 0.787292
H  -3.944455 1.659989 1.753688
H  -3.990936 2.139711 0.041755
H  -3.833545 -0.85805 2.395312
H  -5.350982 -1.083816 1.474119
H  -3.942854 -2.112178 1.118263
H  -5.475348 -0.425636 -1.016444
H  -4.061686 0.334054 -1.81252
H  -4.022359 -1.402841 -1.383744
H  -1.80358 -2.087733 0.20901
H  0.106591 -3.104604 1.422043
H  2.007522 -0.661907 -1.636188
H  -0.399921 3.254416 -0.668914
H  2.523506 0.407745 0.820936
H  1.826144 -4.877099 1.075248
H  3.763222 -2.410519 -1.934977
H  3.677754 -4.536469 -0.592634
H  1.462522 4.993432 -0.721667
H  3.791444 4.289808 -0.017438
