program: Gaussian 09
title: 000162384
version: EM64L-G09RevD.01
frameworkgroup: C1[X(C14H26O2)]
method: RPBEPBE
basis: SDD
operation: Freq
keyword: #pfreq=noraman
keyword: PBEPBE/SDD
title: #p freq=noraman PBEPBE/SDD
converged: YES YES NO NO
title: Mulliken charges:
elementType: O O C C C C C C C C C C C C C C H H H H H H H H H H H H H H H H H H H H H H H H H H
charge: -0.435473 -0.252256 -0.389296 -0.410118 -0.383153 -0.381678 -0.368207 -0.372056 -0.355628 -0.409139 -0.360114 -0.475754 -0.695361 -0.070257 -0.319817 0.168009 0.203029 0.189652 0.196073 0.193241 0.209655 0.190582 0.206794 0.189081 0.181106 0.189401 0.195947 0.219168 0.209079 0.182568 0.203286 0.205654 0.193437 0.193128 0.215476 0.221942 0.210823 0.213837 0.205735 0.258970 0.256823 0.375808
chargesum: 0.00000
title: Mulliken charges with hydrogens summed into heavy atoms:
elementType: O O C C C C C C C C C C C C C C
charge: -0.059665 -0.252256 0.003386 -0.020804 0.017084 0.014197 0.002301 0.043059 0.036019 -0.000198 0.026451 -0.038337 -0.064966 0.188713 -0.062994 0.168009
polarizability: 1.99951309e+02 1.48785525e+01 1.48930010e+02 -9.32006914e-01 5.93890546e+00 1.29713566e+02
1716.lowfreq: -10.9349 -9.7592 -0.0007 -0.0007 -0.0002 4.9160 14.8371 19.8771 28.3402
frequency: 11.5625 17.8951 28.1388 35.5608 44.3936 66.6575 82.6478 99.1809 107.2857 127.4749 135.1989 155.1684 187.9163 196.3451 220.4190 229.2353 239.3233 263.0536 299.7656 347.2730 359.4498 394.2590 419.3983 460.3251 489.1401 517.4806 584.9932 599.2308 685.5877 709.6891 724.5338 739.1118 771.9396 801.7438 809.0241 835.2052 870.2104 873.1119 895.6358 901.7265 906.8183 941.2874 972.0674 992.6317 1001.0148 1004.9441 1015.2375 1049.0261 1057.1480 1066.4514 1072.0368 1083.3420 1092.7256 1111.6668 1115.1596 1139.7563 1150.8982 1178.6487 1192.1371 1218.3708 1234.8420 1239.7170 1246.7904 1269.6262 1277.5851 1282.1981 1285.8835 1289.1410 1290.6060 1298.6861 1306.8563 1317.7193 1333.5955 1342.1576 1346.9511 1348.8596 1354.1203 1357.8820 1363.5648 1388.1344 1460.1118 1461.8386 1463.3298 1463.6201 1465.9029 1468.0072 1470.1423 1474.4137 1476.7080 1478.7099 1484.9649 1490.0224 1641.0020 1660.7424 2948.7483 2951.9258 2953.9698 2957.0943 2961.3082 2963.3304 2966.2951 2968.4808 2969.5396 2972.8130 2978.8725 2985.3950 2995.2371 3002.8888 3007.8228 3016.1294 3023.7422 3027.6044 3039.1009 3043.6379 3046.7553 3064.9149 3068.7464 3089.1717 3152.4227 3520.4945
redmass: 3.2465 4.2666 3.1868 4.7835 2.5504 3.3390 3.2105 3.4770 1.6997 3.5082 2.2858 2.7791 2.3157 2.8082 1.1608 2.5093 2.6252 2.5016 2.1930 2.6172 4.1031 2.4602 2.6020 2.7526 2.8163 2.3409 1.3981 3.2895 2.7665 1.1797 1.0894 1.1617 1.2985 1.7709 1.5611 2.0282 1.6502 2.2383 2.0193 1.9377 1.9065 2.2977 1.4616 1.6534 1.6914 1.5373 2.2164 1.6614 2.6003 2.0459 1.9825 2.0461 1.7454 1.7641 2.3705 2.0663 1.6020 1.4258 1.5954 1.3790 1.3770 1.3881 1.3481 1.2716 1.2418 1.2240 1.0865 1.1781 1.1699 1.1953 1.3257 1.3351 1.3969 1.3974 1.5236 1.6501 1.6355 1.4738 1.4975 1.2174 1.0815 1.0715 1.0768 1.1029 1.0736 1.0832 1.0718 1.0425 1.0841 1.0810 1.0851 1.0935 8.5340 6.1656 1.0588 1.0593 1.0599 1.0601 1.0612 1.0609 1.0598 1.0628 1.0368 1.0622 1.0623 1.0948 1.0981 1.0996 1.0996 1.1003 1.1008 1.1025 1.1039 1.1012 1.0972 1.1004 1.0994 1.0910 1.0926 1.0640
irintensity: 0.1267 0.1700 0.0187 1.0720 0.0933 0.0445 0.0322 0.1807 0.0250 0.4319 0.1632 0.5191 0.0418 0.6075 0.0194 1.1492 0.4114 0.1483 0.4014 0.5050 6.3942 1.9039 0.4388 3.3338 13.5357 7.0016 110.7948 29.3715 70.9621 11.8420 6.7944 1.8612 5.6426 3.7593 0.5804 8.8827 5.3056 5.2193 3.0164 8.1733 4.2386 44.2288 13.4908 22.3615 9.8754 36.7320 47.2043 144.1542 54.1881 46.1136 1.3599 1.5054 8.4365 3.1271 0.6509 8.4749 1.1375 8.3430 0.1148 0.5497 2.4005 3.2446 6.3596 8.7818 6.0577 4.0137 2.3555 0.8512 0.2206 2.7409 3.0844 7.7223 3.9124 3.2916 4.6708 49.8913 1.7149 1.5336 0.8229 11.6237 13.9979 1.5148 4.4750 8.3364 0.9279 4.7014 1.5569 10.8094 17.2090 6.2037 0.8313 19.4167 252.2915 102.6866 2.6882 4.3670 16.7769 6.7370 11.9085 9.3672 66.2273 171.8728 38.9338 21.4161 42.8876 5.6674 0.5755 10.1708 8.3735 5.3961 25.8298 13.5089 165.3541 117.7338 60.5589 105.1261 56.9453 9.4175 7.4089 34.7570
temp: 298.150 k
press: 1.00000 atm
elementType: 8 8 6 6 6 6 6 6 6 6 6 6 6 6 6 6 1 1 1 1 1 1 1 1 1 1 1 1 1 1 1 1 1 1 1 1 1 1 1 1 1 1
symmnumber: 1
zpe: 977998.2 jmol-1
zpe.correction: 0.372500 hartree
zpe.thermalcorrener: 0.392544 hartree
zpe.thermalcorrenthalpy: 0.393489 hartree
zpe.thermalcorrgfe: 0.319669 hartree
zpe.sumelectzpe: -698.224207 hartree
zpe.sumelectthermal: -698.204162 hartree
zpe.sumelectthermalent: -698.203218 hartree
zpe.sumelectthermalfe: -698.277038 hartree
dipole: -1.3418 -1.3585 -1.1773
dipole: 2.2432
quadrupole: -91.2243 -107.0551 -104.6863
quadrupole: 1.4526 2.2361 -3.7633
quadrupole: 9.7643 -6.0665 -3.6977 1.4526 2.2361 -3.7633
hfenergy: -698.5967066 hartree
pointgroup: C01 [X(C14H26O2)]
dipole: -0.5390892 0.500925 0.4871619 debye
polarizability: 200.1911901|-14.5569782|147.8900743|0.9436844|6.8527367|130.5136196 unknown
InChI: InChI=1S/C14H26O2/c1-2-3-4-5-6-7-8-9-10-11-12-13-14(15)16/h12-13,15H,2-11H2,1H3
charge 0 multiplicity 1
42 atoms
O  1.496637 -2.659469 0.22032
O  0.127986 -3.282082 -1.557099
C  -0.362943 2.773246 -0.551981
C  -1.699076 3.070951 0.176392
C  0.641474 1.941771 0.278945
C  -2.523069 1.822284 0.584175
C  2.008013 1.759553 -0.419788
C  -2.995374 0.968594 -0.61611
C  3.002561 0.90826 0.402118
C  -3.91692 -0.213615 -0.227951
C  4.369324 0.718742 -0.295164
C  -3.223597 -1.313014 0.634286
C  5.355743 -0.1292 0.537175
C  -2.082211 -1.976035 -0.090967
C  -0.798751 -2.059792 0.360946
C  0.250583 -2.72359 -0.438405
H  -0.561514 2.25321 -1.510983
H  0.111371 3.739484 -0.822127
H  -1.480838 3.666127 1.087269
H  -2.327539 3.714094 -0.47434
H  0.216062 0.939786 0.489956
H  0.793978 2.431253 1.264198
H  -1.924911 1.200775 1.278955
H  -3.414628 2.154493 1.156214
H  2.453396 2.756755 -0.621369
H  1.850647 1.283672 -1.410718
H  -3.540999 1.625195 -1.324666
H  -2.118499 0.576232 -1.167794
H  2.554933 -0.087337 0.602659
H  3.162036 1.385211 1.392223
H  -4.792911 0.167566 0.334162
H  -4.312701 -0.686378 -1.149754
H  4.21003 0.240991 -1.2838
H  4.817329 1.712702 -0.500558
H  -3.985101 -2.084649 0.874872
H  -2.878439 -0.891499 1.595745
H  5.559653 0.348008 1.514431
H  6.322408 -0.259607 0.016253
H  4.939834 -1.134698 0.739894
H  -2.305115 -2.420189 -1.074488
H  -0.491674 -1.642243 1.325563
H  2.17931 -3.112256 -0.345185
