program: Gaussian 09
title: 000161993
version: EM64L-G09RevD.01
frameworkgroup: C1[X(C11H16O)]
method: RPBEPBE
basis: SDD
operation: Freq
keyword: #pfreq=noraman
keyword: PBEPBE/SDD
title: #p freq=noraman PBEPBE/SDD
converged: YES YES NO NO
title: Mulliken charges:
elementType: O C C C C C C C C C C C H H H H H H H H H H H H H H H H
charge: -0.187591 -0.112467 -0.237068 -0.252609 -0.187341 -0.546599 -0.417343 -0.236529 -0.232853 -0.134685 -0.367150 -0.696631 0.228835 0.254435 0.267856 0.248743 0.249673 0.243419 0.216088 0.196242 0.241909 0.242466 0.172315 0.196604 0.211009 0.209586 0.211555 0.218132
chargesum: 0.00000
title: Mulliken charges with hydrogens summed into heavy atoms:
elementType: O C C C C C C C C C C C
charge: -0.187591 0.116368 0.017367 0.015247 0.061402 -0.053508 -0.005014 0.005380 0.009613 0.037630 0.040463 -0.057358
polarizability: 1.30743389e+02 4.07797983e+00 1.10613282e+02 1.04773612e+00 -1.31910536e+00 9.48330644e+01
1716.lowfreq: -19.6664 -12.9384 -0.0009 -0.0007 -0.0003 11.5562 51.8414 69.8017 85.9223
frequency: 51.7280 69.6600 85.8047 116.3581 130.0570 188.5785 224.1742 245.3305 292.0474 325.1039 344.0068 449.7077 474.2602 548.3919 614.0696 676.6392 713.1135 732.6424 763.1631 774.7162 798.2701 865.6878 877.9156 894.6890 905.4852 915.6741 926.6637 936.0116 961.0240 975.6821 989.3637 1030.8530 1038.8506 1041.1323 1075.8301 1082.8075 1098.4317 1107.9898 1123.6834 1169.2207 1179.7490 1197.1557 1218.4846 1226.4936 1253.5196 1263.0107 1267.7488 1280.4296 1285.7258 1306.5142 1319.3321 1331.7603 1347.2141 1378.7001 1391.3698 1460.2824 1473.8627 1475.9178 1478.8797 1486.1123 1576.1179 1628.5565 2840.4818 2954.4321 2958.1194 2969.1110 2973.2683 2981.1521 3001.1265 3020.3589 3028.7249 3069.6469 3073.1428 3077.9935 3095.4777 3099.9731 3151.7547 3184.8297
redmass: 3.8662 4.1235 1.6875 3.0942 3.2634 3.5654 1.8155 1.2976 3.8034 3.2386 3.3790 2.1282 2.3752 2.7357 3.5325 3.9979 1.5266 1.5042 2.6064 2.9267 2.5780 2.5988 1.5569 1.8393 2.1209 1.7848 1.4800 2.9694 1.8765 2.0913 1.7465 1.5949 2.2633 1.8679 1.6222 1.3223 1.3192 2.0902 1.4141 2.4281 1.3389 1.5741 1.4543 1.3847 1.4593 1.3808 1.3926 1.3747 1.1659 1.6424 1.4895 1.5290 1.6140 1.2114 1.2128 1.0751 1.0643 1.1038 1.0423 1.0740 5.7604 8.1101 1.0836 1.0602 1.0836 1.0602 1.0367 1.0833 1.0977 1.0601 1.1024 1.1007 1.0993 1.0893 1.1040 1.0933 1.0873 1.1094
irintensity: 1.7837 5.6652 0.5297 0.0466 2.6692 3.7815 1.0708 0.3422 1.7203 1.2838 0.9779 4.4302 1.1624 1.2829 20.2116 7.0791 33.6756 28.9400 0.3894 3.1836 9.4420 2.2249 2.2666 7.5936 7.2363 10.4208 1.5480 4.6351 6.8760 8.6478 3.7727 3.3052 9.6383 8.5155 0.3974 4.0644 1.3498 10.8674 2.1448 1.3894 1.5548 7.3369 16.4310 1.5195 11.8968 2.0249 2.6386 0.6112 0.9880 6.7383 4.6850 11.6605 1.8722 0.8626 10.2712 2.2423 3.7391 12.0072 12.5745 12.6916 2.7919 182.2619 121.6049 10.6129 18.3322 46.1990 35.0147 39.2483 4.0621 31.2915 37.7582 72.6811 37.8728 51.8274 25.1989 18.5072 7.2233 19.7296
temp: 298.150 k
press: 1.00000 atm
elementType: 8 6 6 6 6 6 6 6 6 6 6 6 1 1 1 1 1 1 1 1 1 1 1 1 1 1 1 1
symmnumber: 1
zpe: 633670.0 jmol-1
zpe.correction: 0.241352 hartree
zpe.thermalcorrener: 0.253131 hartree
zpe.thermalcorrenthalpy: 0.254075 hartree
zpe.thermalcorrgfe: 0.203123 hartree
zpe.sumelectzpe: -503.016892 hartree
zpe.sumelectthermal: -503.005113 hartree
zpe.sumelectthermalent: -503.004169 hartree
zpe.sumelectthermalfe: -503.055121 hartree
dipole: 3.0562 0.8195 -0.8739
dipole: 3.2827
quadrupole: -83.0954 -75.6510 -70.9129
quadrupole: -5.9731 3.3308 1.1033
quadrupole: -6.5423 0.9021 5.6402 -5.9731 3.3308 1.1033
hfenergy: -503.258244 hartree
pointgroup: C01 [X(C11H16O1)]
dipole: -1.2037662 -0.287644 -0.3690099 debye
polarizability: 130.984335|3.4736559|110.3940585|-0.2638869|1.4441064|94.8113422 unknown
InChI: InChI=1S/C11H16O/c1-2-3-10-8-4-5-9(6-8)11(10)7-12/h4-5,7-11H,2-3,6H2,1H3
charge 0 multiplicity 1
28 atoms
O  2.786663 1.967927 0.314505
C  -0.351063 0.39843 0.338838
C  -0.097396 -1.055216 0.930075
C  1.775911 -0.716208 -0.32085
C  0.939372 0.594653 -0.577017
C  1.441223 -0.983161 1.180077
C  -1.681448 0.609154 -0.411346
C  -0.144565 -2.048492 -0.237639
C  0.979422 -1.844646 -0.987486
C  1.655463 1.883074 -0.224794
C  -2.934884 0.42116 0.474616
C  -4.247096 0.707288 -0.28724
H  -0.311873 1.105929 1.194398
H  -0.735083 -1.289631 1.795941
H  2.838402 -0.624095 -0.586745
H  0.614942 0.673577 -1.63506
H  1.858811 -1.937293 1.542014
H  1.750306 -0.159217 1.847138
H  -1.72664 -0.088968 -1.271939
H  -1.697159 1.633269 -0.841003
H  -0.975235 -2.724786 -0.457299
H  1.241008 -2.316867 -1.938541
H  1.079012 2.813456 -0.477293
H  -2.863982 1.089284 1.357425
H  -2.956575 -0.614305 0.868511
H  -4.271143 1.748915 -0.659481
H  -4.351358 0.037015 -1.16127
H  -5.131237 0.559254 0.359464
