program: Gaussian 09
title: 000161969
version: EM64L-G09RevD.01
frameworkgroup: C1[X(C16H9Cl2N3O3)]
method: RPBEPBE
basis: SDD
operation: Freq
keyword: #p
keyword: freq=noraman
keyword: PBEPBE/SDD
title: #p freq=noraman PBEPBE/SDD
converged: YES YES NO NO
title: Mulliken charges:
elementType: Cl Cl O O O N N N C C C C C C C C C C C C C C C C H H H H H H H H H
charge: -0.007723 -0.034129 -0.184037 -0.239850 -0.198305 -0.300572 0.087522 -0.404184 0.433980 0.440222 -0.359559 -0.346551 -0.340932 -0.367141 0.021403 0.310914 0.270765 -0.327057 -0.345145 -0.215136 -0.209047 -0.112663 -0.347451 0.163006 0.308575 0.305424 0.268738 0.266223 0.282788 0.377537 0.261959 0.263191 0.277236
chargesum: 0.00000
title: Mulliken charges with hydrogens summed into heavy atoms:
elementType: Cl Cl O O O N N N C C C C C C C C C C C C C C C C
charge: -0.007723 -0.034129 -0.184037 -0.239850 -0.198305 -0.300572 0.087522 -0.026646 0.433980 0.440222 -0.050984 -0.041127 -0.340932 -0.098403 0.021403 0.310914 0.270765 -0.060835 -0.062357 0.046823 0.054144 -0.112663 -0.070215 0.163006
polarizability: 4.15332902e+02 6.51671094e+00 2.20049814e+02 -1.79133462e+01 2.72569775e+00 1.19015360e+02
1716.lowfreq: -5.1260 -3.1270 -0.0016 0.0007 0.0019 1.8665 15.1113 22.0022 23.4477
frequency: 15.1003 21.8239 23.4378 45.3833 54.6286 80.7285 109.4080 117.9071 153.4391 156.0750 161.8023 177.8003 209.6814 235.7493 265.9094 282.7044 299.3538 335.4720 364.3949 382.8204 393.2300 410.9317 424.4149 448.6268 455.7170 475.1936 483.9875 516.3883 542.1573 576.1301 593.8651 619.8092 624.1925 663.5224 673.2698 691.4384 699.7223 704.6839 721.1427 727.6245 766.2916 784.4175 785.6790 836.7112 844.3687 856.7211 864.9552 906.5072 915.1723 946.3959 969.0095 976.2598 989.8291 1000.6227 1013.1749 1035.2254 1044.6974 1071.6839 1110.6325 1153.3735 1171.6934 1185.0656 1194.6237 1236.4940 1272.5742 1281.6935 1294.9837 1307.8951 1311.5952 1362.3084 1370.4707 1371.1287 1398.7020 1401.2976 1469.7368 1476.2065 1535.2896 1548.9856 1563.1947 1581.9945 1596.1993 1604.4742 1644.9706 1657.6346 3148.9865 3153.4818 3155.0579 3174.3156 3177.5857 3189.0383 3204.4959 3216.6986 3509.0400
redmass: 9.7917 7.8505 11.2772 5.7940 7.4260 10.5572 10.1173 7.5795 15.4522 8.0405 5.7786 9.1324 9.5845 9.2308 8.7481 8.6361 8.0476 7.6096 11.3068 8.6927 7.4194 3.0599 5.6451 4.0486 6.4815 4.8141 4.8577 7.6410 8.2378 7.0563 6.3807 5.7429 5.5241 7.0717 4.2837 6.1898 9.5321 2.4802 7.1577 4.6073 3.2485 1.7277 7.4873 1.3080 1.3880 1.7357 1.4323 1.4542 6.2393 3.6050 1.3799 1.3266 1.3896 3.8138 6.6593 3.4135 6.1275 2.8746 1.3446 2.1815 1.4975 1.2202 4.7620 2.5405 4.1688 1.8571 1.2661 2.2323 2.2826 4.8144 1.8817 4.4942 4.2127 4.0535 2.3936 2.7503 9.4772 10.4216 8.4900 7.7772 6.6229 7.1503 9.9946 5.8305 1.0910 1.0888 1.0890 1.0963 1.0975 1.0933 1.0918 1.0942 1.0772
irintensity: 0.2197 0.7675 0.1832 0.1080 0.4950 3.3786 0.5574 0.2331 0.6660 7.0011 1.3254 3.1439 2.0512 5.0146 0.0643 2.4712 0.1191 13.9460 15.5583 6.8802 12.0805 1.4341 11.1223 1.4074 24.5374 16.8559 38.9551 6.8569 2.0218 14.0895 5.5506 4.1359 0.3454 18.4952 14.2125 0.0218 12.8583 26.3209 18.9882 7.4085 33.3734 112.1763 18.0361 10.7755 23.2162 55.3845 30.0197 27.8395 145.1924 10.8719 0.5424 1.8280 5.6504 34.1268 59.1980 22.2528 33.9669 71.3608 11.0363 10.9375 3.5276 31.0677 46.9162 33.4702 542.0858 27.6042 4.9961 71.2681 137.4721 9.5632 17.0771 11.6988 23.2650 14.9043 29.0126 42.7282 70.4130 110.0912 45.3411 81.3983 183.4857 89.3111 322.9042 584.3038 7.4787 2.1833 0.2418 4.2017 2.0204 0.5881 3.5253 6.5770 76.8443
temp: 298.150 k
press: 1.00000 atm
elementType: 17 17 8 8 8 7 7 7 6 6 6 6 6 6 6 6 6 6 6 6 6 6 6 6 1 1 1 1 1 1 1 1 1
symmnumber: 1
zpe: 577672.5 jmol-1
zpe.correction: 0.220024 hartree
zpe.thermalcorrener: 0.240271 hartree
zpe.thermalcorrenthalpy: 0.241215 hartree
zpe.thermalcorrgfe: 0.167290 hartree
zpe.sumelectzpe: -1923.491318 hartree
zpe.sumelectthermal: -1923.471071 hartree
zpe.sumelectthermalent: -1923.470127 hartree
zpe.sumelectthermalfe: -1923.544052 hartree
dipole: 0.4380 -2.2203 -0.2953
dipole: 2.2822
quadrupole: -163.7036 -161.8275 -149.7542
quadrupole: 4.3221 -1.5775 -2.4850
quadrupole: -5.2752 -3.3991 8.6743 4.3221 -1.5775 -2.4850
hfenergy: -1923.7113423 hartree
pointgroup: C01 [X(C16H9Cl2N3O3)]
dipole: 0.2209074 -0.866974 -0.0760421 debye
polarizability: 414.3897895|16.4222515|221.3120292|-15.6575712|-2.5644415|118.6962571 unknown
InChI: InChI=1S/C16H9Cl2N3O3/c17-10-3-1-9(2-4-10)15(23)12-6-5-11(7-13(12)18)21-16(24)20-14(22)8-19-21/h1-8,20H
charge 0 multiplicity 1
33 atoms
Cl -0.534684 3.29349 -1.166756
Cl -6.996156 -2.500802 -0.737013
O  -2.676625 2.485112 1.039489
O  3.05304 -2.424486 0.587677
O  7.261443 -0.635039 -0.371845
N  3.209296 -0.100338 0.056266
N  4.002229 0.978545 -0.324677
N  5.131074 -1.495583 0.113508
C  1.794025 0.210769 0.159101
C  -0.964925 0.943345 0.331253
C  1.335479 1.412926 -0.436453
C  0.880586 -0.6326 0.840024
C  -0.019727 1.761248 -0.336349
C  -0.475497 -0.259209 0.90499
C  -2.404684 1.346004 0.558188
C  -3.49196 0.36148 0.243964
C  3.735715 -1.418615 0.278491
C  -3.28426 -0.769512 -0.591258
C  -4.7925 0.609147 0.763848
C  -4.349447 -1.642335 -0.897853
C  -5.862347 -0.257136 0.474371
C  -5.62151 -1.374786 -0.354124
C  5.303377 0.816164 -0.46697
C  6.021845 -0.454417 -0.253776
H  2.036961 2.062596 -0.960325
H  1.21215 -1.565343 1.293634
H  -1.174298 -0.909841 1.441145
H  -2.297132 -0.960809 -1.023323
H  -4.94277 1.494595 1.389961
H  5.533012 -2.426511 0.274487
H  -4.196966 -2.508249 -1.547936
H  -6.86209 -0.072995 0.877485
H  5.876645 1.698486 -0.761224
