program: Gaussian 09
title: 000161953
version: EM64L-G09RevD.01
frameworkgroup: C1[X(C20H26O3)]
method: RPBEPBE
basis: SDD
operation: Freq
keyword: #pfreq=noraman
keyword: PBEPBE/SDD
title: #p freq=noraman PBEPBE/SDD
converged: YES YES NO NO
title: Mulliken charges:
elementType: O O O C C C C C C C C C C C C C C C C C C C C H H H H H H H H H H H H H H H H H H H H H H H H H H
charge: -0.284528 -0.259930 -0.176598 0.371050 0.406568 -0.273541 -0.048318 -0.458669 -0.589415 0.318339 -0.515839 -0.495697 -0.440243 -0.357656 -0.816404 -0.457865 0.307979 0.199402 -0.773082 -0.773030 0.068150 0.054233 -0.778085 0.238343 0.176564 0.247642 0.224770 0.228274 0.223090 0.217912 0.221479 0.196711 0.192485 0.201658 0.259078 0.221788 0.227365 0.239144 0.204854 0.210768 0.213885 0.218332 0.213637 0.228789 0.214549 0.216373 0.226651 0.257047 0.251994
chargesum: 0.00000
title: Mulliken charges with hydrogens summed into heavy atoms:
elementType: O O O C C C C C C C C C C C C C C C C C C C C
charge: -0.284528 -0.259930 -0.176598 0.371050 0.406568 -0.035198 0.128245 -0.211027 -0.136371 0.318339 -0.074836 -0.077507 -0.046100 -0.098578 -0.128108 -0.042244 0.307979 0.199402 -0.127229 -0.113319 0.068150 0.054233 -0.042394
polarizability: 3.21925499e+02 -4.99737307e+00 1.95028153e+02 3.07101139e+01 4.27503440e+00 1.67253143e+02
1716.lowfreq: -5.7130 -2.5549 -0.0004 -0.0003 0.0004 16.4663 37.4518 51.3505 80.8652
frequency: 37.4182 51.2565 80.8338 88.1742 106.2003 116.5244 151.1394 167.7101 184.3452 195.8451 214.9719 229.9411 244.2309 262.6629 269.4941 275.2572 293.8807 301.8354 307.3236 312.1298 333.0700 348.0246 366.2333 370.8506 390.8984 402.0731 426.2030 435.1400 462.3476 483.6050 499.6720 526.4117 539.7262 555.8590 562.5856 611.9434 637.8073 651.9107 660.6134 702.1568 713.8646 734.3273 743.4614 757.1944 774.3090 808.6959 827.8612 837.8652 847.1647 863.4146 882.1433 892.3203 908.8347 928.7941 931.2942 941.6600 950.4225 971.1533 976.3538 986.7400 1006.1751 1020.1647 1036.6572 1040.7483 1054.9349 1057.5120 1072.9909 1085.5666 1093.9154 1104.3053 1118.0152 1140.3903 1151.4857 1175.9868 1186.2612 1188.1957 1200.1419 1206.3447 1215.1573 1228.3270 1235.0867 1270.4357 1280.5311 1298.0213 1306.4994 1314.7061 1325.5787 1330.7415 1332.3193 1338.2557 1341.6260 1349.3334 1361.1714 1377.0323 1384.8721 1393.2021 1402.4871 1402.9288 1418.9083 1454.1277 1454.7584 1461.2513 1463.6180 1463.9730 1464.8591 1468.1012 1474.4116 1479.7354 1486.3966 1490.5343 1500.5796 1503.0694 1653.1086 1669.9877 1706.5672 2901.7668 2948.0780 2951.9359 2953.0591 2968.1529 2980.0951 2981.4483 2982.7728 2984.3836 2997.1437 3002.2419 3014.7223 3025.0916 3037.5748 3042.3932 3055.9214 3059.7813 3061.0641 3065.5595 3072.8473 3079.2654 3088.7360 3096.9815 3109.0329 3109.5968 3164.2564
redmass: 4.5839 3.7105 2.6704 1.2897 3.0399 2.9344 3.6285 2.7795 1.5015 3.0571 1.7289 2.4502 1.3178 3.3879 2.6362 2.4773 2.7156 2.2285 2.1230 2.8945 3.2773 3.5315 3.3673 3.0205 3.1442 2.4812 2.7623 3.5513 2.9656 3.9886 3.0590 3.5713 2.2806 4.5032 4.0872 4.7799 3.1081 5.7225 6.8800 6.4681 3.4563 5.3315 6.7741 3.4121 3.2604 4.2253 2.1942 2.2700 1.6181 1.8313 2.1137 2.3557 2.0111 1.5884 3.3258 2.0655 1.9095 1.8982 1.7602 1.5636 1.7854 1.8551 1.5030 1.6125 2.1551 1.7744 1.9024 1.8385 2.0333 1.8527 3.5366 1.6584 1.9764 1.8104 2.1156 1.9627 1.8766 2.4215 1.4780 2.0393 1.5021 1.9358 1.6007 1.4658 2.2050 1.7775 1.7683 1.4193 1.4976 1.4847 1.3866 1.5408 1.3435 1.2206 2.3782 1.2341 1.2711 1.2871 3.9355 1.0435 1.0797 1.0718 1.0621 1.0763 1.0759 1.0826 1.0777 1.0598 1.0579 1.0632 1.0546 1.0612 8.8088 9.4236 11.8970 1.0811 1.0697 1.0726 1.0635 1.0363 1.0628 1.0501 1.0503 1.0373 1.0444 1.0557 1.0978 1.0946 1.1026 1.0965 1.1013 1.0996 1.0968 1.0978 1.0979 1.0980 1.0980 1.0994 1.0910 1.0949 1.0912
irintensity: 0.0291 0.6624 3.2650 0.0880 0.3492 0.4523 0.3297 1.1123 0.6334 0.1134 0.4798 1.0453 0.0904 0.9584 3.9089 1.6086 0.4440 0.1703 1.1366 0.7435 2.4623 0.4367 1.1068 0.7532 1.4721 1.1577 0.8241 1.6949 0.3162 10.6471 0.6377 10.5524 0.5465 9.2750 3.1593 6.3081 2.8969 2.3086 7.8751 9.4827 5.0214 4.4686 8.4672 0.8076 10.4987 63.6646 5.5979 28.1713 8.1934 19.3544 2.0448 19.5869 7.8365 2.9395 25.0404 3.3412 2.4056 7.2418 13.1843 3.3276 1.0136 10.6452 3.8244 4.7041 19.2645 11.0485 1.7993 7.9545 2.9549 17.0928 28.2980 13.9772 1.1216 8.3563 3.1748 5.9535 20.5629 35.0995 13.0109 4.0578 5.9967 9.4102 10.1140 0.4599 10.3674 0.7694 1.3082 0.4802 3.1747 0.3446 1.0305 2.0997 7.4637 17.1217 20.7760 12.7726 26.7192 14.5279 8.1782 11.8316 2.9344 2.1779 9.3782 5.7199 10.7000 8.1007 11.3094 10.6985 22.7083 4.3214 13.3457 2.7640 135.9272 68.2637 450.1217 22.7930 19.7139 11.2586 58.6590 43.9460 24.3547 19.4857 30.8919 15.1659 10.7052 28.7961 56.5983 39.7557 53.9441 27.1991 23.3575 43.0952 10.0596 70.9178 37.2450 21.4878 41.0556 8.7664 22.5307 27.7065 4.3731
temp: 298.150 k
press: 1.00000 atm
elementType: 8 8 8 6 6 6 6 6 6 6 6 6 6 6 6 6 6 6 6 6 6 6 6 1 1 1 1 1 1 1 1 1 1 1 1 1 1 1 1 1 1 1 1 1 1 1 1 1 1
symmnumber: 1
zpe: 1088076.4 jmol-1
zpe.correction: 0.414426 hartree
zpe.thermalcorrener: 0.435710 hartree
zpe.thermalcorrenthalpy: 0.436654 hartree
zpe.thermalcorrgfe: 0.366729 hartree
zpe.sumelectzpe: -1001.625114 hartree
zpe.sumelectthermal: -1001.603831 hartree
zpe.sumelectthermalent: -1001.602886 hartree
zpe.sumelectthermalfe: -1001.672812 hartree
dipole: -6.1108 2.7525 1.7692
dipole: 6.9317
quadrupole: -158.1000 -141.8670 -139.3058
quadrupole: 17.3508 6.4770 7.2471
quadrupole: -11.6758 4.5573 7.1185 17.3508 6.4770 7.2471
hfenergy: -1002.0395409 hartree
pointgroup: C01 [X(C20H26O3)]
dipole: -2.4046895 1.0688666 0.7157597 debye
polarizability: 321.8954569|-5.5811374|194.8498147|30.6855858|4.813364|167.4615235 unknown
InChI: InChI=1S/C20H26O3/c1-11-15-12(22-17(11)21)10-14-19(4)8-5-7-18(2,3)13(19)6-9-20(14)16(15)23-20/h10,13-14,16H,5-9H2,1-4H3
charge 0 multiplicity 1
49 atoms
O  1.363239 2.016955 -1.487324
O  3.214897 -1.69218 -0.499093
O  5.335689 -1.617973 0.544351
C  0.253713 1.408141 -0.649441
C  -1.359807 -0.564762 -0.113356
C  -0.191111 -0.009062 -1.065546
C  -2.522225 0.504812 -0.147718
C  1.617836 1.627109 -0.028267
C  -0.864413 2.415672 -0.406333
C  -3.932981 0.054012 0.401983
C  -2.033279 1.853949 0.432593
C  -1.879713 -1.90297 -0.720379
C  -4.301918 -1.328321 -0.220266
C  0.946729 -1.006824 -1.169431
C  -0.778455 -0.823249 1.302255
C  -3.194536 -2.390462 -0.074761
C  2.531009 0.476938 0.08216
C  2.14851 -0.765439 -0.583669
C  -5.004906 1.075604 -0.08181
C  -4.033082 -0.016973 1.951801
C  3.78952 0.330415 0.623178
C  4.269186 -1.037717 0.286101
C  4.651812 1.292114 1.383568
H  -0.654002 0.092397 -2.072099
H  -2.704822 0.679704 -1.23549
H  1.766401 2.487945 0.634769
H  -1.252446 2.712831 -1.401886
H  -0.444735 3.330221 0.051891
H  -1.727093 1.736393 1.488641
H  -2.852039 2.595841 0.423985
H  -1.105093 -2.68651 -0.618045
H  -2.054708 -1.761125 -1.808921
H  -4.50991 -1.184164 -1.302135
H  -5.245125 -1.688502 0.2375
H  0.76624 -1.959035 -1.677074
H  -0.350901 0.087521 1.756584
H  -1.54344 -1.209316 1.992889
H  0.029942 -1.573763 1.250071
H  -3.51423 -3.332144 -0.561493
H  -3.029794 -2.6367 0.992385
H  -4.927229 1.25617 -1.170994
H  -6.018719 0.682255 0.12256
H  -4.921076 2.048648 0.435036
H  -3.669609 0.911272 2.42875
H  -5.092084 -0.145124 2.246322
H  -3.471153 -0.862075 2.383001
H  4.170936 2.278624 1.490338
H  5.623091 1.430388 0.873798
H  4.882184 0.902257 2.392621
