program: Gaussian 09
title: 000161946
version: EM64L-G09RevD.01
frameworkgroup: C1[X(C9H12O3S)]
method: RPBEPBE
basis: SDD
operation: Freq
keyword: #p
keyword: freq=noraman
keyword: PBEPBE/SDD
title: #p freq=noraman PBEPBE/SDD
converged: NO YES NO NO
title: Mulliken charges:
elementType: S O O O C C C C C C C C C H H H H H H H H H H H H
charge: 0.945202 -0.566196 -0.506974 -0.502026 -0.218995 0.625697 -0.301400 -0.700860 -0.683325 -0.364303 -0.252761 -0.236428 -0.234555 0.252183 0.200652 0.223848 0.237066 0.250798 0.219511 0.206495 0.242780 0.299829 0.236522 0.246967 0.380275
chargesum: 0.00000
title: Mulliken charges with hydrogens summed into heavy atoms:
elementType: S O O O C C C C C C C C C
charge: 0.945202 -0.185921 -0.506974 -0.502026 0.033187 0.625697 -0.301400 -0.039295 -0.006522 -0.121523 0.047069 0.000095 0.012412
polarizability: 1.48018593e+02 2.59498087e+00 1.51958184e+02 5.30416462e-01 -5.22291927e-01 8.84425926e+01
1716.lowfreq: -13.2825 -6.3269 -0.0022 -0.0015 -0.0009 3.6289 14.8324 53.8055 89.9357
frequency: 13.5977 53.7868 89.9274 124.3315 136.5813 173.4418 199.8704 215.8759 224.6294 235.9131 246.8499 272.9648 298.3200 317.5398 340.3316 362.7992 422.1456 462.7271 475.3697 537.4094 557.3620 564.8190 643.8569 738.3220 743.9267 774.2165 831.8653 883.5771 892.7808 922.9298 954.8836 961.4721 968.1287 983.5949 1001.1034 1026.2946 1049.1608 1071.2914 1103.2735 1118.2884 1161.2311 1176.4754 1214.5074 1266.5861 1292.1279 1348.5859 1377.0510 1392.9202 1398.1543 1429.2603 1454.8635 1464.7755 1470.7083 1483.5963 1487.4048 1566.2855 1604.8741 2978.1492 2982.7995 3039.4965 3071.5983 3082.2189 3087.3967 3093.3862 3137.3602 3150.5001 3158.6146 3174.2835 3478.3498
redmass: 2.8125 6.8417 4.2088 4.2888 5.1548 2.0902 1.5277 3.1070 1.7467 3.7102 1.1428 3.1517 3.5702 6.4956 4.2494 3.5093 9.5304 4.1489 3.8134 5.1268 4.5868 3.5722 6.2543 3.9618 3.7419 1.2576 12.8981 1.4188 2.5392 1.2074 5.0466 1.7313 1.3698 5.8628 1.3499 2.2623 1.1801 1.5383 2.2667 2.3031 1.5880 1.1032 1.9245 1.8072 1.3306 2.0269 1.1891 1.8795 1.4022 1.9572 2.0200 1.0932 1.0665 1.0522 1.0891 5.5646 7.0557 1.0353 1.0357 1.0850 1.0999 1.0978 1.1005 1.0999 1.0861 1.0891 1.0947 1.1007 1.0661
irintensity: 0.2056 0.1017 0.3729 2.4070 2.6691 29.2847 9.7944 4.8073 10.9481 17.9007 0.9873 10.3637 49.8046 5.5931 3.7929 6.4167 61.7899 15.1179 2.4052 85.7769 36.8437 30.0254 7.1422 2.7891 2.1961 79.1420 59.4711 0.4910 4.1157 5.2262 83.9747 23.1012 2.8616 2.0423 0.0182 13.9465 68.0276 10.4946 9.5825 2.1169 2.4656 0.8365 13.5007 0.7556 0.3802 3.4073 18.7752 18.1608 4.4651 5.8777 19.6377 3.7053 5.1770 9.5034 24.6433 0.1970 4.8672 24.2083 30.5231 1.5204 0.5957 64.7893 19.8380 25.2217 2.5498 12.0081 3.1496 21.0083 40.5028
temp: 298.150 k
press: 1.00000 atm
elementType: 16 8 8 8 6 6 6 6 6 6 6 6 6 1 1 1 1 1 1 1 1 1 1 1 1
symmnumber: 1
zpe: 502545.9 jmol-1
zpe.correction: 0.191410 hartree
zpe.thermalcorrener: 0.205803 hartree
zpe.thermalcorrenthalpy: 0.206747 hartree
zpe.thermalcorrgfe: 0.149449 hartree
zpe.sumelectzpe: -972.725578 hartree
zpe.sumelectthermal: -972.711185 hartree
zpe.sumelectthermalent: -972.710240 hartree
zpe.sumelectthermalfe: -972.767538 hartree
dipole: 4.0809 0.8799 1.2891
dipole: 4.3691
quadrupole: -85.0975 -76.2545 -90.5559
quadrupole: 4.7437 -5.8941 -4.4446
quadrupole: -1.1282 7.7148 -6.5866 4.7437 -5.8941 -4.4446
hfenergy: -972.9169875 hartree
pointgroup: C01 [X(C9H12O3S1)]
dipole: 1.6077932 -0.0955393 0.6005379 debye
dipolederiv: 1.7646008 0.0295912 -0.0434914 0.0459906 1.3381115 -0.0748774 -0.1535609 -0.0721848 1.4986577 -0.5080922 -0.0249168 0.2346357 -0.02159 -0.6093673 0.1543531 0.2920314 0.1526825 -0.8944825 -0.7046573 0.0878036 -0.0363297 0.0679752 -0.6138861 0.057578 -0.0004651 -0.0034251 -0.4583375 -0.6877136 -0.026287 -0.0397729 -0.0246582 -0.5866242 -0.1307301 -0.0204931 -0.0723991 -0.5484534 0.0743615 0.0619805 0.0083128 -0.0205353 0.0597612 -0.0283735 0.0060094 -0.1143087 0.0961898 -0.1488097 0.2220407 -0.0198321 -0.2329941 0.2843039 0.0173654 -0.0131658 0.0457237 -0.0416459 0.1125156 0.0096982 0.0211979 0.0307768 -0.1362171 -0.0160569 -0.0655796 -0.040082 -0.1483853 0.0824577 -0.0292778 -0.0297742 0.0372573 -0.0303304 0.026842 -0.0374911 -0.0122557 -0.0178551 0.0887152 -0.0112061 -0.025064 0.0359102 -0.0385244 -0.0225568 -0.0181979 0.0789888 -0.0491525 -0.016324 -0.2777592 0.0183096 0.0185734 -0.1726475 -0.0111697 0.015738 -0.0149812 -0.1246314 -0.1682531 -0.1538525 -0.0054207 0.2236257 -0.0905462 0.0092366 -0.0075845 -0.0007848 -0.0815812 0.1680882 0.0292672 0.0144446 0.0111925 0.1022981 -0.0053703 0.0137572 -0.0095887 -0.1163603 -0.1299484 0.1460358 -0.0016335 -0.0183763 0.069078 -0.0143956 0.015956 0.0031986 -0.1554106 -0.0550049 -0.0250298 0.0226583 0.0127564 0.0390428 -0.0016655 0.0189311 -0.000923 0.0145691 -0.1597115 0.0125001 0.0047454 -0.045559 0.1021922 0.0151352 0.064835 0.0125245 0.0593539 0.0708971 -0.0619757 -0.0065192 -0.0310606 -0.181225 0.0424322 -0.0183371 0.0157914 0.0869927 0.0695401 0.022511 0.0374735 0.0169211 0.0723792 -0.105078 0.0195514 -0.0643091 -0.1081966 0.0378254 0.0191674 -0.1024323 0.048817 0.0796761 0.0787379 -0.0638339 0.0709881 -0.0286412 0.0882683 -0.039845 0.0158404 -0.0246098 -0.1999541 -0.0247603 0.021889 -0.0183838 0.0747077 -0.1401666 -0.0094933 0.0868979 -0.0636224 0.084575 -0.0020875 0.010648 -0.001343 0.0617246 -0.0226623 0.0858413 -0.017365 0.0815554 0.0199873 0.0088099 -0.0182904 0.0049418 0.1370695 0.1062914 0.0719677 -0.0137708 0.0308658 0.1065738 0.0035044 -0.012655 0.0045718 0.1614647 -0.0877455 -0.0722021 -0.01153 -0.0570868 0.0686933 0.0010575 -0.0124129 0.0010435 0.1502537 0.0500649 -0.0410715 -0.0050273 -0.0481832 -0.0811139 0.0101916 -0.0085584 0.0081794 0.166517 0.115463 -0.025488 -0.1065529 -0.0739419 0.3137637 0.0118777 -0.0287209 0.0263348 0.265633 unknown
polarizability: 149.4705581|3.3783113|150.2036606|3.681001|-2.1502467|88.7451508 unknown
InChI: InChI=1S/C9H12O3S/c1-7(2)8-5-3-4-6-9(8)13(10,11)12/h3-7,10H,1-2H3
charge 0 multiplicity 1
25 atoms
S  -1.978026 0.273743 -0.196563
O  -2.184456 -0.382954 1.536766
O  -2.847626 1.63075 -0.352058
O  -2.25299 -0.946175 -1.226151
C  0.562963 -1.788537 0.142585
C  0.84066 -0.282585 0.097204
C  -0.146872 0.719588 -0.032799
C  1.334945 -2.485719 1.291173
C  0.890035 -2.430327 -1.23423
C  2.175394 0.208897 0.156328
C  0.097355 2.103999 -0.086081
C  2.471135 1.586596 0.098772
C  1.435679 2.542213 -0.020022
H  -0.513094 -1.944852 0.332555
H  2.429382 -2.458912 1.135762
H  1.037381 -3.548658 1.342027
H  1.110618 -2.018949 2.266545
H  0.260785 -1.995112 -2.029513
H  0.692165 -3.517013 -1.198191
H  1.952842 -2.283263 -1.50313
H  2.992809 -0.512467 0.256907
H  -0.737497 2.806087 -0.178261
H  3.513882 1.918267 0.148727
H  1.662165 3.612125 -0.059212
H  -3.139334 -0.669841 1.631562
