program: Gaussian 09
title: 000161922
version: EM64L-G09RevD.01
frameworkgroup: C1[X(C26H28O4)]
method: RPBEPBE
basis: SDD
operation: Freq
keyword: #pfreq=noraman
keyword: PBEPBE/SDD
title: #p freq=noraman PBEPBE/SDD
converged: YES YES NO NO
title: Mulliken charges:
elementType: O O O O C C C C C C C C C C C C C C C C C C C C C C C C C C H H H H H H H H H H H H H H H H H H H H H H H H H H H H
charge: -0.296196 -0.302450 -0.438001 -0.419961 -0.337475 -0.383070 -0.065233 -0.619113 0.230141 0.303909 0.497528 0.548129 -0.366473 -0.413553 -0.455964 -0.406901 -0.433322 -0.401880 -0.261711 -0.256067 -0.502916 -0.393127 -0.366234 -0.225980 -0.241759 0.355037 -0.249644 -0.311016 -0.114458 -0.299134 0.238004 0.272775 0.219965 0.225881 0.228964 0.250364 0.230224 0.226073 0.276948 0.241408 0.245516 0.226355 0.225856 0.233868 0.203353 0.208025 0.245924 0.242483 0.222492 0.221194 0.225371 0.222971 0.204959 0.193639 0.169062 0.235132 0.359150 0.330939
chargesum: 0.00000
title: Mulliken charges with hydrogens summed into heavy atoms:
elementType: O O O O C C C C C C C C C C C C C C C C C C C C C C C C C C
charge: -0.296196 -0.302450 -0.078852 -0.089021 -0.099471 -0.110295 0.154732 -0.164267 0.230141 0.303909 0.497528 0.548129 -0.116109 -0.183329 -0.229890 -0.129953 -0.191914 -0.156364 -0.035356 -0.030212 0.142330 -0.147203 -0.123751 -0.003489 -0.020565 0.355037 -0.024273 0.116914 0.079180 0.105060
polarizability: 3.45755250e+02 2.34874431e+01 3.05542907e+02 2.94804084e+00 1.52296060e+01 2.17175126e+02
1716.lowfreq: -8.0925 -5.6913 0.0004 0.0005 0.0013 2.6733 12.0448 16.4654 28.9614
frequency: 11.7237 16.2470 28.9338 30.5469 40.7348 43.4324 52.6260 59.0598 64.7917 78.5497 82.1868 99.2231 129.8985 131.2792 141.1446 176.9250 184.0239 203.3351 207.3070 227.2524 232.4460 248.5137 257.4404 268.4690 292.7024 311.4413 327.3844 343.7259 381.8279 405.2322 410.9500 431.3478 437.4306 440.6183 455.3267 466.3442 482.4989 509.7494 526.3936 528.4840 553.1611 555.2294 594.9645 610.9386 618.5517 636.7267 651.3794 688.6145 706.8503 711.6277 732.3860 752.8028 763.8783 768.6662 784.1519 808.5932 814.4042 823.9551 842.2210 847.3418 850.9512 855.6383 872.7151 901.0918 919.1571 925.7992 935.5235 947.9973 950.9773 956.3252 963.8910 977.7108 987.0080 991.0597 992.4577 993.7662 998.0313 1004.3472 1007.9956 1029.6709 1036.7637 1049.2415 1049.9794 1071.9188 1080.0891 1090.6076 1099.2794 1101.4076 1111.6978 1115.3892 1146.5999 1159.0122 1170.3426 1173.5730 1179.2339 1186.8719 1189.7833 1192.4216 1200.7943 1207.6933 1213.2261 1215.8789 1217.3755 1223.5572 1247.7247 1259.7660 1266.2219 1281.9648 1283.7664 1300.4434 1314.1115 1314.7307 1332.0077 1339.4061 1345.7571 1355.3629 1356.1082 1376.2467 1378.1466 1385.0188 1386.5451 1407.2726 1417.0817 1433.0746 1437.5216 1442.5764 1450.2256 1451.2095 1461.3154 1465.6870 1475.6874 1481.8338 1486.2413 1499.3142 1584.5436 1589.2964 1589.8521 1612.1613 1613.0712 1620.9910 2912.8004 2932.3106 2934.7673 2941.2777 2961.7660 2966.1599 2976.1647 2996.1930 3010.3774 3023.3987 3029.4390 3085.6222 3098.1515 3107.7325 3112.7016 3121.4400 3121.6877 3123.1892 3131.8272 3136.3076 3137.0362 3154.0988 3155.1688 3157.7284 3163.8783 3165.3255 3529.0063 3559.9420
redmass: 5.4913 4.7404 3.9301 3.3216 4.1060 4.6732 3.8659 3.8853 4.2201 4.0388 3.2586 2.7613 3.7093 3.5862 2.3575 4.7916 4.6808 2.2928 1.6484 4.3101 3.2379 3.9393 4.0537 4.3333 3.7114 2.9493 4.0514 5.4164 3.2241 2.8374 2.9199 2.9192 1.6967 3.2491 2.1442 2.2412 3.7383 4.9210 3.0455 4.0065 4.4689 2.8550 4.3922 4.8163 5.8937 6.4913 5.5429 5.0939 1.6895 3.6596 3.7499 1.3378 4.3335 2.0845 3.9900 1.7450 3.4051 1.7918 2.4557 3.1968 2.8413 1.2538 1.3750 3.6309 1.5614 1.5457 1.7903 1.9099 4.1283 1.4848 1.3841 1.4260 1.3259 4.8754 1.8191 4.2460 2.1815 2.9128 2.6114 2.1778 2.9209 2.7584 3.2174 1.9201 1.6376 2.2413 3.2632 2.1477 1.2742 1.3770 1.3374 1.1510 1.0574 1.0832 1.3647 2.1330 1.1360 1.2723 1.5962 1.7882 1.9777 1.1821 2.1410 2.3577 1.5392 1.0983 1.7718 1.2486 1.4989 1.6912 1.3177 1.3969 1.2753 1.3090 1.4412 1.3084 1.5549 3.4057 2.3989 3.6295 2.6050 1.5687 3.0456 1.1975 2.1584 1.9808 1.1215 1.0941 1.0958 1.0982 1.0667 2.2557 2.3229 2.4799 7.0194 6.7385 6.2397 6.1905 6.2612 6.4277 1.0828 1.0347 1.0696 1.0804 1.0552 1.0709 1.0789 1.0832 1.1026 1.0947 1.1076 1.0927 1.0977 1.0875 1.0865 1.0870 1.0873 1.0884 1.0890 1.0930 1.0932 1.0966 1.0944 1.1005 1.0957 1.0980 1.0651 1.0662
irintensity: 0.0553 0.5848 1.1120 2.2697 1.0503 0.5010 0.5841 1.0972 0.6931 5.8793 5.3036 2.5607 10.2684 6.2513 4.8533 1.8391 11.8872 17.9950 79.9985 15.5005 6.2230 7.1236 9.6100 1.5646 1.5362 0.3487 0.5462 1.3878 3.2372 0.1029 0.3526 30.4230 152.1416 5.9935 41.4927 31.8965 1.5137 1.2187 3.9341 1.3243 11.2808 36.1543 30.6054 3.1282 1.9254 0.4011 1.4600 5.9989 55.4202 3.1030 4.1118 56.5886 6.7295 38.7726 14.3306 15.5416 7.8131 9.6254 31.3923 24.4766 8.3000 0.3862 1.7803 5.8097 3.2565 37.4059 1.4089 29.2461 90.9897 1.5301 1.8222 0.2896 0.2835 0.1776 9.8947 13.6004 7.0367 9.8391 13.1601 12.3812 36.6072 102.1075 55.1293 24.9371 14.7141 12.3146 28.7801 9.7132 0.7983 7.8890 17.3828 85.6046 0.2343 1.1809 89.5193 4.1462 3.2245 15.0672 0.0325 3.8276 2.6294 18.3927 151.0245 65.4787 1.0663 16.3370 4.2511 24.9694 1.6010 3.3336 0.4036 0.4727 33.9802 24.4358 4.4279 2.8257 2.0493 8.8837 14.2099 0.6033 6.2318 4.2655 0.9308 6.5983 6.0293 9.1205 12.0178 23.3252 20.8540 10.0606 8.8760 20.0062 32.7147 147.0360 2.2851 6.7405 2.0695 3.5315 5.8323 48.7296 59.6380 80.9667 62.1571 47.6720 46.0530 40.0159 24.4959 16.4751 56.2609 39.7109 36.6231 22.1741 23.2140 14.6193 8.4578 2.0934 2.1484 14.1289 13.9159 33.9494 29.4211 28.3347 14.1379 37.3299 5.3729 13.6083 11.9682 8.4926
temp: 298.150 k
press: 1.00000 atm
elementType: 8 8 8 8 6 6 6 6 6 6 6 6 6 6 6 6 6 6 6 6 6 6 6 6 6 6 6 6 6 6 1 1 1 1 1 1 1 1 1 1 1 1 1 1 1 1 1 1 1 1 1 1 1 1 1 1 1 1
symmnumber: 1
zpe: 1246309.2 jmol-1
zpe.correction: 0.474694 hartree
zpe.thermalcorrener: 0.502968 hartree
zpe.thermalcorrenthalpy: 0.503913 hartree
zpe.thermalcorrgfe: 0.411837 hartree
zpe.sumelectzpe: -1306.239187 hartree
zpe.sumelectthermal: -1306.210913 hartree
zpe.sumelectthermalent: -1306.209968 hartree
zpe.sumelectthermalfe: -1306.302044 hartree
dipole: -4.7500 -1.9889 -0.3408
dipole: 5.1609
quadrupole: -197.8170 -169.9529 -169.1113
quadrupole: -15.3575 15.0049 4.2989
quadrupole: -18.8566 9.0075 9.8491 -15.3575 15.0049 4.2989
hfenergy: -1306.7138809 hartree
pointgroup: C01 [X(C26H28O4)]
dipole: -1.7735541 -0.9819422 -0.1139957 debye
polarizability: 340.0608908|27.8058244|310.2773542|-1.3296117|17.41516|218.1350382 unknown
InChI: InChI=1S/C26H28O4/c1-29-24-15-20-9-5-6-10-23(20)25(26(24)18-7-3-2-4-8-18)19-11-13-22(14-12-19)30-17-21(28)16-27/h2-14,21,24-28H,15-17H2,1H3
charge 0 multiplicity 1
58 atoms
O  -4.370224 0.154498 0.56583
O  4.101542 0.25584 0.616963
O  6.342004 1.746674 -0.056569
O  8.803396 0.131478 -0.735753
C  -2.243358 0.368773 -0.610573
C  -1.617131 -0.606737 0.449741
C  -3.753547 0.060889 -0.771943
C  -3.930531 -1.341661 -1.383121
C  -2.054682 -2.064949 0.219944
C  -3.150316 -2.407109 -0.621694
C  -1.944536 1.837814 -0.316398
C  -0.096103 -0.434265 0.489719
C  -1.380759 -3.103628 0.914324
C  -3.530089 -3.766619 -0.7529
C  -1.089969 2.569845 -1.179667
C  -2.489812 2.502231 0.815207
C  0.521263 0.324676 1.516524
C  0.732577 -0.976959 -0.521793
C  -1.765171 -4.453057 0.780004
C  -2.847318 -4.790875 -0.065693
C  -5.829865 0.19817 0.542438
C  1.912811 0.538263 1.536644
C  2.130677 -0.775895 -0.522245
C  -0.787322 3.927626 -0.930179
C  -2.191017 3.859974 1.065958
C  2.719138 -0.009855 0.512916
C  -1.338533 4.579533 0.196274
C  4.988539 -0.270533 -0.433794
C  6.379889 0.28495 -0.091494
C  7.422789 -0.143847 -1.133399
H  -1.78319 0.125467 -1.590561
H  -2.023821 -0.300593 1.434406
H  -4.220519 0.824432 -1.433922
H  -5.002245 -1.615548 -1.421036
H  -3.592848 -1.300603 -2.439878
H  -0.53835 -2.843219 1.565631
H  -4.379369 -4.020454 -1.40063
H  -0.649474 2.067838 -2.050493
H  -3.161915 1.951201 1.479957
H  -0.098984 0.763427 2.306722
H  0.283951 -1.587032 -1.31505
H  -1.227929 -5.233919 1.329877
H  -3.157819 -5.835486 -0.180485
H  -6.145279 0.403664 1.577881
H  -6.197822 1.007856 -0.123133
H  -6.272669 -0.765981 0.21864
H  2.387127 1.124786 2.329495
H  2.738472 -1.218171 -1.317585
H  -0.121302 4.472612 -1.608965
H  -2.623982 4.358462 1.941363
H  -1.105768 5.632074 0.394448
H  4.658948 0.099068 -1.426236
H  4.977413 -1.379618 -0.423547
H  6.666887 -0.114204 0.910784
H  7.28823 -1.227125 -1.353825
H  7.274237 0.43527 -2.05948
H  5.571201 2.00535 0.514455
H  8.936778 -0.157097 0.202599
