program: Gaussian 09
title: 000161893
version: EM64L-G09RevD.01
frameworkgroup: C1[X(C21H18O7)]
method: RPBEPBE
basis: SDD
operation: Freq
keyword: #pfreq=noraman
keyword: PBEPBE/SDD
title: #p freq=noraman PBEPBE/SDD
converged: YES YES NO NO
title: Mulliken charges:
elementType: O O O O O O O C C C C C C C C C C C C C C C C C C C C C H H H H H H H H H H H H H H H H H H
charge: -0.456517 -0.354354 -0.363733 -0.181625 -0.169483 -0.167664 -0.288138 0.221508 -0.569135 -0.637041 -0.566591 0.199339 0.229850 -0.109549 -0.131036 0.127451 0.195119 0.194363 -0.146469 -0.207822 -0.778440 0.115575 0.302625 0.207414 -0.421054 -0.353358 -0.204992 -0.515711 0.252886 0.254036 0.264293 0.243034 0.243672 0.233349 0.347097 0.244701 0.269949 0.259482 0.363875 0.371609 0.290984 0.253781 0.237033 0.228840 0.267735 0.203110
chargesum: 0.00000
title: Mulliken charges with hydrogens summed into heavy atoms:
elementType: O O O O O O O C C C C C C C C C C C C C C C C C C C C C
charge: -0.109419 0.009521 0.007876 -0.181625 -0.169483 -0.167664 -0.288138 0.221508 -0.062213 -0.129713 -0.089570 0.199339 0.229850 -0.109549 -0.131036 0.127451 0.195119 0.194363 -0.146469 -0.207822 -0.004308 0.115575 0.302625 0.207414 -0.130070 -0.099577 0.032041 0.183975
polarizability: 4.04682132e+02 -8.84051510e+00 2.79065495e+02 -1.28734365e+01 1.36032289e+00 1.35250339e+02
1716.lowfreq: -7.6924 -3.1980 0.0003 0.0006 0.0007 6.2325 17.7557 28.9002 38.7641
frequency: 17.2479 28.8866 38.7497 49.7199 54.9513 79.0216 96.9803 103.7762 110.3886 126.5691 144.2136 151.2390 163.4001 171.5465 189.1071 189.8864 214.6910 223.1414 232.5514 267.5512 279.1411 290.0709 300.8690 309.2451 340.2338 345.7837 347.9281 357.3025 375.2319 376.6904 381.6319 390.2885 418.5962 429.2581 454.9813 462.8721 479.9905 492.9861 516.4687 530.7871 551.8104 554.9168 582.3738 587.5789 603.5958 628.0204 664.4638 682.7137 694.6340 720.5327 735.0300 757.5807 775.2914 803.1728 821.1691 850.3721 861.9394 870.8741 881.8498 911.5188 930.9802 937.8702 955.9260 966.9583 989.0273 997.8906 1014.4465 1017.1022 1031.7604 1059.6166 1070.6129 1084.4657 1094.5254 1102.9462 1125.9180 1151.0621 1161.1225 1164.0772 1174.3200 1195.4716 1213.4739 1218.3438 1219.5147 1239.4872 1260.0771 1272.1416 1295.5085 1295.5168 1311.6443 1337.8162 1345.8819 1365.7784 1370.5179 1375.6275 1402.1591 1412.5176 1417.7937 1430.6550 1435.5359 1437.9461 1445.6664 1448.3375 1451.9554 1452.6344 1454.4820 1459.1498 1483.6009 1540.7386 1547.1262 1575.1432 1586.6251 1604.8581 1607.9862 1623.7920 2944.8043 2951.2651 2965.9758 2984.9656 2996.6101 2997.6418 3015.9658 3071.1324 3075.7450 3080.2259 3127.0070 3127.2471 3139.0963 3159.9795 3171.8434 3542.8727 3543.8478 3556.9583
redmass: 6.4486 5.0735 5.7167 5.7785 5.9991 5.6888 4.3028 3.2467 2.3500 1.4367 2.3264 5.7318 1.5825 3.7999 4.2152 4.0132 3.4938 3.9022 1.6284 3.7370 3.3488 3.1759 2.5061 5.2974 2.0006 1.4260 6.5867 2.0965 4.0854 3.6863 4.4568 4.7044 6.2045 5.2581 9.5633 4.6239 5.8797 5.4498 6.1761 4.9288 5.2984 4.3670 3.7971 4.4284 3.3366 5.9004 5.1290 5.6873 4.3651 6.3636 2.8553 3.9962 8.1808 2.3484 4.0674 2.5832 3.9710 5.0550 5.7819 3.4907 2.8278 1.6470 2.4783 2.6523 3.0618 1.3558 4.1828 2.2697 2.2655 2.6454 2.2967 2.5335 2.5771 1.2363 1.9904 1.3241 1.1636 1.4365 1.3876 1.8048 2.7396 3.4590 2.6547 1.3511 3.0675 1.3758 4.1320 2.7574 1.7988 1.8444 2.0986 1.3090 1.5699 9.1019 3.9858 1.8250 2.6032 1.6247 3.3591 2.0268 1.5473 1.0718 1.2381 1.2322 1.0807 1.1161 1.0551 10.0767 9.0588 7.2770 7.0340 8.7901 8.4344 9.1117 1.0580 1.0588 1.0350 1.0394 1.0993 1.0967 1.0659 1.1019 1.0917 1.0973 1.1041 1.1018 1.0871 1.0924 1.0986 1.0650 1.0661 1.0651
irintensity: 0.1033 2.2751 7.0105 3.7441 2.2486 0.8957 2.8439 0.0189 3.9721 1.1272 0.2080 0.4301 0.5575 6.4116 6.9473 8.3378 8.8207 12.6555 68.4961 17.0742 15.7509 6.6402 27.7559 4.4455 53.9254 112.8043 11.2430 63.3367 15.7038 11.0931 7.9333 16.9096 5.7543 2.7237 0.5333 1.0870 8.3915 7.3509 19.3691 3.6891 1.6944 16.6090 6.4198 6.1224 0.3222 6.5119 4.2088 15.8272 13.0590 10.1846 4.1572 33.6152 2.0588 18.4592 20.9822 33.9852 1.6109 15.3390 52.8983 33.4976 70.2080 17.1670 25.4043 40.7243 14.9973 1.7366 25.2308 21.0768 28.1875 9.1564 21.7950 79.9707 36.5443 12.2772 28.8062 5.3893 26.3723 1.0809 22.0915 56.4028 115.1426 113.0866 123.0241 21.1369 418.5043 12.8227 192.3691 88.3476 58.9339 15.1964 31.5844 81.3555 12.8897 15.9066 41.2565 8.1009 15.2699 6.6241 89.9333 12.8805 18.6387 21.3098 14.4131 13.8598 15.8839 9.6259 11.9368 90.8894 264.3621 52.7034 8.1829 26.0895 5.4908 123.3110 17.6076 21.8203 108.6220 2.5449 10.7135 6.1753 22.8875 17.4022 9.0537 22.0615 18.6310 11.1618 8.3909 4.8834 20.1585 31.2569 10.5039 34.7209
temp: 298.150 k
press: 1.00000 atm
elementType: 8 8 8 8 8 8 8 6 6 6 6 6 6 6 6 6 6 6 6 6 6 6 6 6 6 6 6 6 1 1 1 1 1 1 1 1 1 1 1 1 1 1 1 1 1 1
symmnumber: 1
zpe: 901342.7 jmol-1
zpe.correction: 0.343303 hartree
zpe.thermalcorrener: 0.369328 hartree
zpe.thermalcorrenthalpy: 0.370272 hartree
zpe.thermalcorrgfe: 0.286962 hartree
zpe.sumelectzpe: -1335.573850 hartree
zpe.sumelectthermal: -1335.547825 hartree
zpe.sumelectthermalent: -1335.546881 hartree
zpe.sumelectthermalfe: -1335.630191 hartree
dipole: 4.1319 -0.9763 2.0463
dipole: 4.7130
quadrupole: -136.4608 -160.3660 -166.8457
quadrupole: -1.7486 12.4611 1.5416
quadrupole: 18.0967 -5.8085 -12.2882 -1.7486 12.4611 1.5416
hfenergy: -1335.9171533 hartree
pointgroup: C01 [X(C21H18O7)]
dipole: 1.6184106 -0.3315179 0.8420785 debye
polarizability: 405.5078853|-5.340634|278.6705318|-7.1394489|-0.205506|134.8195491 unknown
InChI: InChI=1S/C21H18O7/c1-9(22)21(27)7-6-10-12(8-21)19(25)15-16(17(10)23)20(26)14-11(18(15)24)4-3-5-13(14)28-2/h3-5,23,25,27H,6-8H2,1-2H3
charge 0 multiplicity 1
46 atoms
O  4.437175 -0.295411 1.734567
O  1.197681 2.631341 -0.397786
O  0.045116 -2.847846 0.012563
O  6.674638 -0.333161 -0.858592
O  -2.394616 -2.224652 -0.901178
O  -1.377223 3.01345 -0.922629
O  -4.865886 -1.825313 0.501908
C  4.491808 -0.182047 0.250237
C  4.193294 -1.534391 -0.413053
C  3.418113 0.865371 -0.108764
C  2.824158 -2.076435 0.040777
C  1.994129 0.325045 -0.175492
C  1.708174 -1.051807 -0.100716
C  0.926391 1.260979 -0.32634
C  0.351865 -1.493065 -0.146048
C  5.917023 0.340733 -0.112997
C  -0.426079 0.828836 -0.418203
C  -0.716152 -0.575167 -0.329899
C  -2.129439 -1.059893 -0.474955
C  -1.548718 1.805261 -0.572165
C  6.344471 1.666178 0.496769
C  -3.212539 -0.083183 -0.146331
C  -2.931027 1.310504 -0.249527
C  -4.533591 -0.489361 0.223082
C  -3.946918 2.274247 -0.048332
C  -5.532057 0.486807 0.45499
C  -5.246344 1.861587 0.305986
C  -5.36623 -2.639279 -0.628072
H  4.997396 -2.255041 -0.176118
H  4.209105 -1.402025 -1.509913
H  3.68088 1.327508 -1.083454
H  3.497188 1.657212 0.66616
H  2.892062 -2.402315 1.100234
H  2.603997 -2.978224 -0.566873
H  4.997711 -1.063827 2.01845
H  5.871795 2.502115 -0.05568
H  6.018935 1.737878 1.54837
H  7.436596 1.780129 0.418386
H  2.143517 2.81515 -0.165745
H  0.851006 -3.364058 0.267644
H  -3.687843 3.330461 -0.166292
H  -6.522947 0.14346 0.77019
H  -6.032493 2.603924 0.480527
H  -5.651997 -3.603458 -0.181134
H  -4.561015 -2.783903 -1.366995
H  -6.252012 -2.158516 -1.089058
